{"text_format":"1","workbook":"xlsx","n_sheets":6,"sheets":["vloeibare mestopslag","vaste mestopslag","Blad3","Samenvatting opslagen","Afdrukversie","versiebeheer"],"not_rendered":{"charts":0,"images":6,"macros":1,"external_links":0,"defined_names":3,"comments":0,"pivot_tables":0},"unopened":[],"bounds":{"document_bytes":16777216,"sheet_cells":100000,"rows_first":2000,"rows_last":500,"rows_between":2000,"halvings":0,"cell_chars":16384,"cell_head_chars":4096},"cells_cut":0,"cells_raw":0,"read":"whole","date_system":"1900"}

{"sheet":"vloeibare mestopslag","index":0,"n_rows":82,"n_cols":64,"rows_kept":82,"cut":false,"hidden":false,"merged":[[66,10,66,11],[11,10,11,11],[12,10,12,11],[13,10,13,11],[25,10,25,11],[26,10,26,11],[27,10,27,11],[43,10,43,11],[44,10,44,11],[45,10,45,11],[64,10,64,11],[65,10,65,11],[61,17,63,19],[57,17,59,19],[19,0,19,1],[37,0,37,1],[36,17,38,19],[53,0,53,1],[35,0,35,1],[36,0,36,1],[51,0,51,1],[52,0,52,1],[0,15,1,16],[5,0,5,1],[6,0,6,1],[17,0,17,1],[18,0,18,1],[0,0,1,13],[7,0,7,1]]}
["Vloeibare mestopslag",null,null,null,null,null,null,null,null,null,null,null,null,null,null,"Totale opslag vloeibare mest",null,"Capaciteit","Opgeslagen","Inhoud N","Inhoud P2O5",null,null,null,null,null,null,null,null,null,null,null,null,null,null,null,null,null,null,null,null,null,null,null,null,null,null,null,"volgnummer","a =","a1 =","b =","b1 =","h =","h1 =","of h2 =","d =","of R =","omtrek =","inhoud =","L =","hoek ß=","Capaciteit","inhoud"]
[null,null,null,null,null,null,null,null,null,null,null,null,null,null,null,null,null,{"$f":"'Samenvatting opslagen'!Q94","v":0},{"$f":"'Samenvatting opslagen'!R94","v":0},{"$f":"'Samenvatting opslagen'!S94","v":0},{"$f":"'Samenvatting opslagen'!T94","v":0}]
[null,null,null,null,"a",null,null,null,null,null,null,null,null,null,null,null,null,null,null,{"$f":"IF(('Samenvatting opslagen'!B95-'Samenvatting opslagen'!S95)<>0,\"niet alle inhoudswaarden N werden opgegeven\",\"\")","v":""},{"$f":"IF(('Samenvatting opslagen'!B95-'Samenvatting opslagen'!T95)<>0,\"niet alle inhoudswaarden P2O5 werden opgegeven\",\"\")","v":""}]
["Rechthoekig",null,null,null,null,null,null,null,null,null,"meter",null,null,"Capaciteit",null,"Opgeslagen",null,"formule",null,null,null,null,null,null,"h2",null,null,null,null,null,null,null,null,null,1,"rechthoekige opslagput 1"]
[null,null,"     b",null,null,null,null,"h1 =",null,"a =",null,null,null,null,null,null,null,null,null,null,null,null,null,null,"h1 en h2 zijn beide ingevuld ==> er zal enekel met h1 gerekend worden",null,null,null,null,null,null,null,null,null,2,"rechthoekige opslagput 2"]
["volgnummer:",null,null,null,null,null,null,null,null,"b =",null,null,null,{"$f":"K5*K6*K7","v":0},null,{"$f":"IF(K5*K6*IF(K9=\"\",K10,K7-K9)<0,0,K5*K6*IF(K9=\"\",K10,K7-K9))","v":0},null,"a*b*h",null,null,null,null,null,null,null,null,null,null,null,null,null,null,null,null,3,"rechthoekige opslagput 3"]
[1,null,null,null,null,null,null,"h",null,"h =",null,null,null,null,null,null,null,null,null,null,null,null,null,null,{"$f":"A4&\" \"&A7","v":"Rechthoekig 1"},null,null,null,null,null,null,null,null,null,4,"rechthoekige opslagput 4"]
["(max 20 opslagen)",null,null,null,null,null,null,"h2",null,null,null,null,null,null,null,null,null,null,null,null,null,null,null,null,null,null,null,null,null,null,null,null,null,null,5,"rechthoekige opslagput 5"]
[null,null,null,null,null,null,null,null,null,"h1 =",null,null,null,null,null,null,{"$f":"IF(OR(K9>K7,K10>K7),\"De waarde van h1 of h2 kan niet groter zijn dan h\",\"\")","v":""},null,null,null,null,null,null,"naam opslagput = ",{"$f":"IF(K12=\"\",VLOOKUP(A7,AI4:AK23,2,),K12)","v":"rechthoekige opslagput 1"},null,null,null,null,null,null,null,null,null,6,"rechthoekige opslagput 6"]
[null,null,null,null,null,null,null,null,null,"of h2 =",null,null,null,null,null,null,{"$f":"IF(AND(K9<>\"\",K10<>\"\"),\"h1 en h2 zijn beide ingevuld ==> er zal enkel met h1 gerekend worden\",\"\")","v":""},null,null,null,null,null,null,"mestsoort =",{"$f":"IF(K13=\"ANDERE\",IF(K14=\"\",K13,K14),K13)","v":0},null,null,null,null,null,null,null,null,null,7,"rechthoekige opslagput 7"]
[null,null,null,null,null,null,null,null,null,null,null,null,null,null,null,null,null,null,null,null,null,null,null,"inhoud N =",{"$f":"IFERROR(IF(K13=\"ANDERE\",IF(N14=\"\",\"/\",N14*P6),N13*P6),\"/\")","v":"/"},null,null,null,null,null,null,null,null,null,8,"rechthoekige opslagput 8"]
[null,null,null,null,null,null,null,null,null,"naam opslag = ",null,null,null,{"$f":"IF(K13=\"\",\"\",\"inhoud N\")","v":""},null,{"$f":"IF(K13=\"\",\"\",\"inhoud P2O5\")","v":""},null,null,null,null,null,null,null,"inhoud P =",{"$f":"IFERROR(IF(K13=\"ANDERE\",IF(P14=\"\",\"/\",P14*P6),P13*P6),\"/\")","v":"/"},null,null,null,null,null,null,null,null,null,9,"rechthoekige opslagput 9"]
[null,null,null,null,null,null,null,null,null,"mestsoort =",null,null,null,{"$f":"IFERROR(VLOOKUP(K13,Blad3!E11:G25,2),\"\")","v":""},null,{"$f":"IFERROR(VLOOKUP(K13,Blad3!E11:G25,3),\"\")","v":""},null,null,null,null,null,null,null,null,null,null,null,null,null,null,null,null,null,null,10,"rechthoekige opslagput 10"]
[null,null,null,null,null,null,null,null,null,{"$f":"IF(K13=\"ANDERE\",\"Geef naam mestsoort en inhoud=\",\"\")","v":""},null,null,null,null,null,null,null,null,null,null,null,null,null,null,null,null,null,null,null,null,null,null,null,null,11,"rechthoekige opslagput 11"]
[null,null,null,null,null,null,null,null,null,null,null,null,null,null,null,null,null,null,null,null,null,null,null,null,null,null,null,null,null,null,null,null,null,null,12,"rechthoekige opslagput 12"]
["Citerne",null,null,null,null,null,null,null,null,null,"meter",null,null,"Capaciteit",null,"Opgeslagen",null,"formule",null,null,null,null,null,null,null,null,null,null,null,null,null,null,null,null,13,"rechthoekige opslagput 13"]
[null,null,null,null,null,null,null,null,null,"d =",null,"*",null,null,null,null,null,null,null,null,null,null,null,null,null,null,null,null,null,null,null,null,null,null,14,"rechthoekige opslagput 14"]
["volgnummer:",null,null,null,null,null,null,null,null,"of R =",null,"*",null,{"$f":"IF(K20<>\"\",K20,IF(AND(K17=\"\",K18=\"\"),(K19*K19)*K22/(4*PI()),IF(K17=\"\",K18*K18*K22*PI(),(K17/2)*(K17/2)*K22*PI())))","v":0},null,{"$f":"IF(K20<>\"\",K20/K22*IF(K23=\"\",K24,K22-K23),IF(AND(K17=\"\",K18=\"\"),(K19*K19)*IF(K23=\"\",K24,K22-K23)/(4*PI()),IF(K17=\"\",K18*K18*IF(K23=\"\",K24,K22-K23)*PI(),(K17/2)*(K17/2)*IF(K23=\"\",K24,K22-K23)*PI())))","v":0},null,"∏ * h * R²",null,null,null,null,null,null,null,null,null,null,null,null,null,null,null,null,15,"rechthoekige opslagput 15"]
[1,null,null,null,null,null,"h1",null,null," of omtrek =",null,"*",null,null,null,null,null,null,null,null,null,null,null,null,{"$f":"A16&\" \"&A19","v":"Citerne 1"},null,null,null,null,null,null,null,null,null,16,"rechthoekige opslagput 16"]
["(max 20 opslagen)",null,null,null,null,null,"   h",null,null,"of inhoud =",null,"*",null,null,null,null,null,null,null,null,null,null,null,null,null,null,null,null,null,null,null,null,null,null,17,"rechthoekige opslagput 17"]
{"$rows_left_out":63}
{"sheet":"vaste mestopslag","index":1,"n_rows":105,"n_cols":36,"rows_kept":105,"cut":false,"hidden":false,"merged":[[15,12,16,12],[15,13,16,13],[30,12,31,12],[30,13,31,13],[50,12,51,12],[50,13,51,13],[68,0,68,1],[66,0,66,1],[25,10,25,11],[26,10,26,11],[27,10,27,11],[44,10,44,11],[45,10,45,11],[46,10,46,11],[59,10,59,11],[60,10,60,11],[61,10,61,11],[34,0,34,1],[51,0,51,1],[52,0,52,1],[53,0,53,1],[67,0,67,1],[17,0,17,1],[18,0,18,1],[19,0,19,1],[32,0,32,1],[33,0,33,1],[0,0,1,13],[0,15,1,16],[5,0,5,1],[6,0,6,1],[7,0,7,1],[76,10,76,11],[22,7,23,7],[12,10,12,11],[10,10,10,11],[11,10,11,11],[74,10,74,11],[75,10,75,11]]}
["Vaste mestopslag",null,null,null,null,null,null,null,null,null,null,null,null,null,null,"Totale opslag vaste mest",null,"Capaciteit","Opgeslagen","Inhoud N","Inhoud P2O5"]
[null,null,null,null,null,null,null,null,null,null,null,null,null,null,null,null,null,{"$f":"'Samenvatting opslagen'!Q204","v":0},{"$f":"'Samenvatting opslagen'!R204","v":0},{"$f":"'Samenvatting opslagen'!S204","v":0},{"$f":"'Samenvatting opslagen'!T204","v":0}]
[null,null,null,null,null,"a"]
["Recht",null,null,null,null,null,null,null,null,null,"meter",null,null,"Capaciteit",null,"Opgeslagen",null,"formule",null,null,null,null,null,null,null,null,null,null,null,null,null,null,null,null,1,"Rechthoekig 1"]
[null,null,"     b",null,null,null,null,null,null,"a =",null,null,null,null,null,null,null,null,null,null,null,null,null,null,null,null,null,null,null,null,null,null,null,null,2,"Rechthoekig 2"]
["volgnummer:",null,null,null,null,null,null,null,null,"b =",null,null,null,{"$f":"K5*K6*K7","v":0},null,{"$f":"K5*K6*K9","v":0},null,"a*b*h",null,null,null,null,null,null,null,null,null,null,null,null,null,null,null,null,3,"Rechthoekig 3"]
[1,null,null,null,null,null,null,"h",null,"h =",null,null,null,null,null,null,null,null,null,null,null,null,null,null,null,null,null,null,null,null,null,null,null,null,4,"Rechthoekig 4"]
["(max 20 opslagen)",null,null,null,null,null,null,"h1 =",null,null,null,null,null,null,null,null,null,null,null,null,null,null,null,"naam opslagput = ",{"$f":"IF(K11=\"\",VLOOKUP(A7,AI4:AJ23,2,FALSE),K11)","v":"Rechthoekig 1"},null,null,null,null,null,null,null,null,null,5,"Rechthoekig 5"]
[null,null,null,null,null,null,null,null,null,"h1 =",null,null,null,null,null,null,null,null,null,null,null,null,null,"mestsoort =",{"$f":"IF(K12=\"ANDERE\",IF(K13=\"\",K12,K13),K12)","v":0},null,null,null,null,null,null,null,null,null,6,"Rechthoekig 6"]
[null,null,null,null,null,null,null,null,null,null,null,null,null,null,null,null,null,null,null,null,null,null,null,"inhoud N =",{"$f":"IFERROR(IF(K12=\"ANDERE\",IF(N13=\"\",\"/\",N13*P6),N12*P6),\"/\")","v":"/"},null,null,null,null,null,null,null,null,null,7,"Rechthoekig 7"]
[null,null,null,null,null,null,null,null,null,"naam opslag = ",null,null,null,{"$f":"IF(K12=\"\",\"\",\"inhoud N\")","v":""},null,{"$f":"IF(K12=\"\",\"\",\"inhoud P2O5\")","v":""},null,{"$f":"IF(K12=\"\",\"\",\"Dichtheid ton/m³\")","v":""},null,null,null,null,null,"inhoud P =",{"$f":"IFERROR(IF(K12=\"ANDERE\",IF(P13=\"\",\"/\",P13*P6),P12*P6),\"/\")","v":"/"},null,null,null,null,null,null,null,null,null,8,"Rechthoekig 8"]
[null,null,null,null,null,null,null,null,null,"mestsoort =",null,null,null,{"$f":"IFERROR(VLOOKUP(K12,Blad3!F31:I61,2,FALSE),\"\")","v":""},null,{"$f":"IFERROR(VLOOKUP(K12,Blad3!F31:I61,3,FALSE),\"\")","v":""},null,{"$f":"IFERROR(VLOOKUP(K12,Blad3!F31:I61,4,FALSE),\"\")","v":""},null,null,null,null,null,null,null,null,null,null,null,null,null,null,null,null,9,"Rechthoekig 9"]
[null,null,null,null,null,null,null,null,null,{"$f":"IF(K12=\"ANDERE\",\"Geef naam mestsoort en inhoud=\",\"\")","v":""},null,null,null,null,null,null,null,null,null,null,null,null,null,null,null,null,null,null,null,null,null,null,null,null,10,"Rechthoekig 10"]
[null,null,null,null,null,null,null,null,null,null,null,null,null,null,null,null,null,null,null,null,null,null,null,null,null,null,null,null,null,null,null,null,null,null,11,"Rechthoekig 11"]
[null,null,null,null,null,null,null,null,null,null,null,null,null,null,null,null,null,null,null,null,null,null,null,null,null,null,null,null,null,null,null,null,null,null,12,"Rechthoekig 12"]
["Hoop",null,null,null,null,null,null,null,null,null,null,null,"capaciteit meerekenen","Ja",null,null,null,null,null,null,null,null,null,null,null,null,null,null,null,null,null,null,null,null,13,"Rechthoekig 13"]
[null,null,null,null,null,null,null,null,null,null,null,null,null,null,null,null,null,null,null,null,null,null,null,null,null,null,null,null,null,null,null,null,null,null,14,"Rechthoekig 14"]
["volgnummer:",null,null,null,null,null,null,null,null,null,"meter",null,null,"Capaciteit",null,"Opgeslagen",null,"formule",null,null,null,null,null,null,null,null,null,null,null,null,null,null,null,null,15,"Rechthoekig 15"]
[1,null,null,null,null,null,null,null,null,"a =",null,null,null,null,null,null,null,null,null,null,null,null,null,null,null,null,null,null,null,null,null,null,null,null,16,"Rechthoekig 16"]
["(max 20 opslagen)",null,null,null,null,null,null,null,null,"b =",null,null,null,{"$f":"IF(N16=\"Nee\",0,1/3*X22*K23)","v":0},null,{"$f":"1/3*X22*K23","v":0},null,"1/3*Ag*h","Ag =","grond oppervlak piramide",null,null,null,null,null,null,null,null,null,null,null,null,null,null,17,"Rechthoekig 17"]
{"$rows_left_out":86}
{"sheet":"Blad3","index":2,"n_rows":61,"n_cols":9,"rows_kept":61,"cut":false,"hidden":true,"merged":[[7,0,7,2],[7,4,7,6]]}
["Ja"]
["Nee"]
[]
[]
[]
["Vloeibaar"]
[]
["Mestsoort vloeibaar",null,null,null,"Mestsoort vloeibaar"]
[null,"N","P2O5",null,null,"N","P2O5"]
[null,"(kg/ton)","(kg/ton)",null,null,"(kg/ton)","(kg/ton)"]
["RUNDEREN",4.8,1.4,null,"ANDERE","",""]
["RUNDEREN (Gier)",4,0.2,null,"BIGGEN 7-20 KG",4.3,1.7]
["MESTKALVEREN",3,1.3,null,"KONIJNEN",8.5,13.5]
["BIGGEN 7-20 KG",4.3,1.7,null,"KONIJNEN (Gier)",1.4,0]
["ZEUGEN EN BIGGEN",3.2,1.4,null,"MESTKALVEREN",3,1.3]
["ZEUGEN EN BIGGEN (Gier)",2,0.9,null,"NERTSEN (Gier)",2,0.2]
["VLEESVARKENS",6.4,3.5,null,"OPFOKPOELJEN",9,8.3000000000000007]
["VLEESVARKENS (Gier)",5.8,0.9,null,"PAARDEN (Gier)",4,0.2]
["OPFOKPOELJEN",9,8.3000000000000007,null,"RUNDEREN",4.8,1.4]
["SCHAPEN (Gier)",4,0.2,null,"RUNDEREN (Gier)",4,0.2]
{"$rows_left_out":42}
{"sheet":"Samenvatting opslagen","index":3,"n_rows":204,"n_cols":73,"rows_kept":204,"cut":false,"hidden":false,"merged":[[2,8,2,9],[2,10,2,11],[3,8,3,9],[3,10,3,11],[0,0,0,20],[2,4,2,5],[3,4,3,5],[2,0,3,3],[2,6,2,7],[3,6,3,7],[9,0,9,20],[99,0,99,20],[7,53,7,71],[5,8,5,9],[5,10,5,11],[6,8,6,9],[6,10,6,11],[5,0,6,3],[5,4,5,5],[5,6,5,7],[6,4,6,5],[6,6,6,7]]}
["Samenvatting van alle opslagen op het bedrijf"]
[]
["Totale opslag vloeibare mest",null,null,null,"Capaciteit",null,"Opgeslagen",null,"Inhoud N",null,"Inhoud P2O5"]
[null,null,null,null,{"$f":"Q94","v":0},null,{"$f":"R94","v":0},null,{"$f":"S94","v":0},null,{"$f":"T94","v":0}]
[]
["Totale opslag vaste mest",null,null,null,"Capaciteit",null,"Opgeslagen",null,"Inhoud N",null,"Inhoud P2O5"]
[null,null,null,null,{"$f":"Q204","v":0},null,{"$f":"R204","v":0},null,{"$f":"S204","v":0},null,{"$f":"T204","v":0}]
[null,null,null,null,null,null,null,null,null,null,null,null,null,null,null,null,null,null,null,null,null,null,null,null,null,null,null,null,null,null,null,null,null,null,null,null,null,null,null,null,null,null,null,null,null,null,null,null,null,null,null,null,null,"afdruk versie"]
[null,null,null,null,null,null,null,null,null,null,null,null,null,null,null,null,null,null,null,null,null,null,null,null,null,null,2,3,4,5,6,7,8,9,10,11,12,13,14,15,16,17,18,19,20,21]
["Overzicht vloeibare mestopslag",null,null,null,null,null,null,null,null,null,null,null,null,null,null,null,null,null,null,null,null,null,null,null,null,{"$f":"IF(A10<>\"\",Z9+1,Z9)","v":1},{"$f":"IF(A10=\"\",\"\",A10)","v":"Overzicht vloeibare mestopslag"},"","","","","","","","","","","","","","","","","","","",1,null,null,null,null,null,null,{"$f":"IFERROR(VLOOKUP($AU10,$Z$10:$AT$203,AA$9,FALSE),\"/\")","v":"Overzicht vloeibare mestopslag"},{"$f":"IFERROR(VLOOKUP($AU10,$Z$10:$AT$203,AB$9,FALSE),\"\")","v":""},{"$f":"IFERROR(VLOOKUP($AU10,$Z$10:$AT$203,AC$9,FALSE),\"\")","v":""},{"$f":"IFERROR(VLOOKUP($AU10,$Z$10:$AT$203,AD$9,FALSE),\"\")","v":""},{"$f":"IFERROR(VLOOKUP($AU10,$Z$10:$AT$203,AE$9,FALSE),\"\")","v":""},{"$f":"IFERROR(VLOOKUP($AU10,$Z$10:$AT$203,AF$9,FALSE),\"\")","v":""},{"$f":"IFERROR(VLOOKUP($AU10,$Z$10:$AT$203,AG$9,FALSE),\"\")","v":""},{"$f":"IFERROR(VLOOKUP($AU10,$Z$10:$AT$203,AH$9,FALSE),\"\")","v":""},{"$f":"IFERROR(VLOOKUP($AU10,$Z$10:$AT$203,AI$9,FALSE),\"\")","v":""},{"$f":"IFERROR(VLOOKUP($AU10,$Z$10:$AT$203,AJ$9,FALSE),\"\")","v":""},{"$f":"IFERROR(VLOOKUP($AU10,$Z$10:$AT$203,AK$9,FALSE),\"\")","v":""},{"$f":"IFERROR(VLOOKUP($AU10,$Z$10:$AT$203,AL$9,FALSE),\"\")","v":""},{"$f":"IFERROR(VLOOKUP($AU10,$Z$10:$AT$203,AM$9,FALSE),\"\")","v":""},{"$f":"IFERROR(VLOOKUP($AU10,$Z$10:$AT$203,AN$9,FALSE),\"\")","v":""},{"$f":"IFERROR(VLOOKUP($AU10,$Z$10:$AT$203,AO$9,FALSE),\"\")","v":""},{"$f":"IFERROR(VLOOKUP($AU10,$Z$10:$AT$203,AP$9,FALSE),\"\")","v":""},{"$f":"IFERROR(VLOOKUP($AU10,$Z$10:$AT$203,AQ$9,FALSE),\"\")","v":""},{"$f":"IFERROR(VLOOKUP($AU10,$Z$10:$AT$203,AR$9,FALSE),\"\")","v":""},{"$f":"IFERROR(VLOOKUP($AU10,$Z$10:$AT$203,AS$9,FALSE),\"\")","v":""}]
[null,null,null,null,null,null,null,null,null,null,null,null,null,null,null,null,null,null,null,null,null,null,null,null,null,{"$f":"IF(A11<>\"\",Z10+1,Z10)","v":1},{"$f":"IF(A11=\"\",\"\",A11)","v":""},"",{"$f":"IF(C11=\"\",\"\",C11)","v":""},{"$f":"IF(D11=\"\",\"\",D11)","v":""},{"$f":"IF(E11=\"\",\"\",E11)","v":""},{"$f":"IF(F11=\"\",\"\",F11)","v":""},{"$f":"IF(G11=\"\",\"\",G11)","v":""},{"$f":"IF(H11=\"\",\"\",H11)","v":""},{"$f":"IF(I11=\"\",\"\",I11)","v":""},{"$f":"IF(J11=\"\",\"\",J11)","v":""},{"$f":"IF(K11=\"\",\"\",K11)","v":""},{"$f":"IF(L11=\"\",\"\",L11)","v":""},{"$f":"IF(M11=\"\",\"\",M11)","v":""},{"$f":"IF(N11=\"\",\"\",N11)","v":""},{"$f":"IF(O11=\"\",\"\",O11)","v":""},{"$f":"IF(P11=\"\",\"\",P11)","v":""},{"$f":"IF(Q11=\"\",\"\",Q11)","v":""},{"$f":"IF(R11=\"\",\"\",R11)","v":""},{"$f":"IF(S11=\"\",\"\",S11)","v":""},{"$f":"IF(T11=\"\",\"\",T11)","v":""},2,null,null,null,null,null,null,{"$f":"IFERROR(VLOOKUP($AU11,$Z$10:$AT$203,AA$9,FALSE),\"/\")","v":"ingegeven opslagen"},"","","","","","","hs =","H =","hs1 =","c =","c1 =","d =","d1 =","","","","","",{"$f":"IFERROR(VLOOKUP('Samenvatting opslagen'!$AU11,'Samenvatting opslagen'!$Z$10:$AT$203,'Samenvatting opslagen'!BV$9,FALSE),\"\")","v":""}]
["ingegeven opslagen",null,null,null,null,null,null,"hs =","H =","hs1 =","c =","c1 =","d =","d1 =",null,null,null,null,null,null,null,null,null,null,null,{"$f":"IF(A12<>\"\",Z11+1,Z11)","v":2},"ingegeven opslagen","","","","","","","hs =","H =","hs1 =","c =","c1 =","d =","d1 =","","","","","","",3,null,null,null,null,null,null,"volgnummer","Naam opslag","mestsoort","a =","a1 =","b =","b1 =","h =","h1 =","of h2 =","d =","of R =","omtrek =","inhoud =","L =","hoek ß=","Capaciteit","inhoud","inhoud N","inhoud P2O5"]
["volgnummer","Naam opslag","mestsoort","a =","a1 =","b =","b1 =","h =","h1 =","of h2 =","d =","of R =","omtrek =","inhoud =","L =","hoek ß=","Capaciteit","inhoud","inhoud N","inhoud P2O5",null,null,null,null,null,{"$f":"IF(A13<>\"\",Z12+1,Z12)","v":3},"volgnummer","Naam opslag","mestsoort","a =","a1 =","b =","b1 =","h =","h1 =","of h2 =","d =","of R =","omtrek =","inhoud =","L =","hoek ß=","Capaciteit","inhoud","inhoud N","inhoud P2O5",4,null,null,null,null,null,null,"Overzicht vaste mestopslag","","","","","","","","","","","","","","","","","","",""]
[1,null,null,null,null,null,null,null,null,null,null,null,null,null,null,null,null,null,null,null,2,"rechthoekig 1",null,{"$f":"IFERROR(VLOOKUP($C14,Blad3!$E$11:$E$25,1,FALSE),IF($C14<>\"\",\"ANDERE\",\"\"))","v":""},{"$f":"IF(ISERROR(VLOOKUP($C14,Blad3!$E$11:$E$25,1,FALSE)),IF($C14<>\"\",$C14,\"\"),\"\")","v":""},{"$f":"IF(B14<>\"\",Z13+1,Z13)","v":3},{"$f":"IF(V14=\"\",\"\",V14)","v":"rechthoekig 1"},{"$f":"IF(B14=\"\",\"\",B14)","v":""},"","","","","","","","","","","","","","","","","","",5,null,null,null,null,null,null,"ingegeven opslagen","","","","","","","","","","","L =","L1 =","L2 =","","r =","","","",""]
[2,null,null,null,null,null,null,null,null,null,null,null,null,null,null,null,null,null,null,null,3,"rechthoekig 2",null,{"$f":"IFERROR(VLOOKUP($C15,Blad3!$E$11:$E$25,1,FALSE),IF($C15<>\"\",\"ANDERE\",\"\"))","v":""},{"$f":"IF(ISERROR(VLOOKUP($C15,Blad3!$E$11:$E$25,1,FALSE)),IF($C15<>\"\",$C15,\"\"),\"\")","v":""},3,"rechthoekig 2","","","","","","","","","","","","","","","","","","","",6,null,null,null,null,null,null,"volgnummer","Naam opslag","mestsoort","a =","a1 =","b =","b1 =","h =","h1 =","c =","c1 =","d =","d1 =","d2 =","R =","","Capaciteit","inhoud","inhoud N","inhoud P2O5"]
[3,null,null,null,null,null,null,null,null,null,null,null,null,null,null,null,null,null,null,null,4,"rechthoekig 3",null,{"$f":"IFERROR(VLOOKUP($C16,Blad3!$E$11:$E$25,1,FALSE),IF($C16<>\"\",\"ANDERE\",\"\"))","v":""},{"$f":"IF(ISERROR(VLOOKUP($C16,Blad3!$E$11:$E$25,1,FALSE)),IF($C16<>\"\",$C16,\"\"),\"\")","v":""},3,"rechthoekig 3","","","","","","","","","","","","","","","","","","","",7,null,null,null,null,null,null,"/","","","","","","","","","","","","","","","","","","",""]
[4,null,null,null,null,null,null,null,null,null,null,null,null,null,null,null,null,null,null,null,5,"rechthoekig 4",null,{"$f":"IFERROR(VLOOKUP($C17,Blad3!$E$11:$E$25,1,FALSE),IF($C17<>\"\",\"ANDERE\",\"\"))","v":""},{"$f":"IF(ISERROR(VLOOKUP($C17,Blad3!$E$11:$E$25,1,FALSE)),IF($C17<>\"\",$C17,\"\"),\"\")","v":""},3,"rechthoekig 4","","","","","","","","","","","","","","","","","","","",8,null,null,null,null,null,null,"/","","","","","","","","","","","","","","","","","","",""]
[5,null,null,null,null,null,null,null,null,null,null,null,null,null,null,null,null,null,null,null,6,"rechthoekig 5",null,{"$f":"IFERROR(VLOOKUP($C18,Blad3!$E$11:$E$25,1,FALSE),IF($C18<>\"\",\"ANDERE\",\"\"))","v":""},{"$f":"IF(ISERROR(VLOOKUP($C18,Blad3!$E$11:$E$25,1,FALSE)),IF($C18<>\"\",$C18,\"\"),\"\")","v":""},3,"rechthoekig 5","","","","","","","","","","","","","","","","","","","",9,null,null,null,null,null,null,"/","","","","","","","","","","","","","","","","","","",""]
[6,null,null,null,null,null,null,null,null,null,null,null,null,null,null,null,null,null,null,null,7,"rechthoekig 6",null,{"$f":"IFERROR(VLOOKUP($C19,Blad3!$E$11:$E$25,1,FALSE),IF($C19<>\"\",\"ANDERE\",\"\"))","v":""},{"$f":"IF(ISERROR(VLOOKUP($C19,Blad3!$E$11:$E$25,1,FALSE)),IF($C19<>\"\",$C19,\"\"),\"\")","v":""},3,"rechthoekig 6","","","","","","","","","","","","","","","","","","","",10,null,null,null,null,null,null,"/","","","","","","","","","","","","","","","","","","",""]
[7,null,null,null,null,null,null,null,null,null,null,null,null,null,null,null,null,null,null,null,8,"rechthoekig 7",null,{"$f":"IFERROR(VLOOKUP($C20,Blad3!$E$11:$E$25,1,FALSE),IF($C20<>\"\",\"ANDERE\",\"\"))","v":""},{"$f":"IF(ISERROR(VLOOKUP($C20,Blad3!$E$11:$E$25,1,FALSE)),IF($C20<>\"\",$C20,\"\"),\"\")","v":""},3,"rechthoekig 7","","","","","","","","","","","","","","","","","","","",11,null,null,null,null,null,null,"/","","","","","","","","","","","","","","","","","","",""]
{"$rows_left_out":185}
{"sheet":"Afdrukversie","index":4,"n_rows":7,"n_cols":54,"rows_kept":7,"cut":false,"hidden":false,"merged":[[5,6,5,7],[5,8,5,9],[6,2,6,3],[6,4,6,5],[6,6,6,7],[6,8,6,9],[0,0,0,19],[2,0,3,1],[5,0,6,1],[2,2,2,3],[2,4,2,5],[2,6,2,7],[2,8,2,9],[3,2,3,3],[3,4,3,5],[3,6,3,7],[3,8,3,9],[5,2,5,3],[5,4,5,5]]}
["Samenvatting van alle opslagen op het bedrijf",null,null,null,null,null,null,null,null,null,null,null,null,null,null,null,null,null,null,null,null,null,null,null,null,null,null,null,null,null,null,null,null,null,null,null,null,null,null,null,null,null,null,null,null,null,null,null,null,null,null,null,null,1]
[]
["Totale opslag vloeibare mest",null,"Capaciteit",null,"Opgeslagen",null,"Inhoud N",null,"Inhoud P2O5"]
[null,null,{"$f":"'Samenvatting opslagen'!E4","v":0},null,{"$f":"'Samenvatting opslagen'!G4","v":0},null,{"$f":"'Samenvatting opslagen'!I4","v":0},null,{"$f":"'Samenvatting opslagen'!K4","v":0}]
[]
["Totale opslag vaste mest",null,"Capaciteit",null,"Opgeslagen",null,"Inhoud N",null,"Inhoud P2O5"]
[null,null,{"$f":"'Samenvatting opslagen'!E7","v":0},null,{"$f":"'Samenvatting opslagen'!G7","v":0},null,{"$f":"'Samenvatting opslagen'!I7","v":0},null,{"$f":"'Samenvatting opslagen'!K7","v":0}]

{"sheet":"versiebeheer","index":5,"n_rows":5,"n_cols":3,"rows_kept":5,"cut":false,"hidden":false,"merged":[[11,2,11,5],[12,2,12,5],[1,2,1,5],[2,2,2,5],[3,2,3,5],[4,2,4,5],[5,2,5,5],[6,2,6,5],[0,0,0,5],[7,2,7,5],[8,2,8,5],[9,2,9,5],[10,2,10,5],[13,2,13,5],[14,2,14,5],[16,2,16,5],[17,2,17,5],[15,2,15,5]]}
["Wijziging"]
["datum","Wat","Reden"]
[" 9/1/2019","Lagune vloeibare mest","* Verwijzing naar foutieve cel waardoor de opgeslagen inhoud niet correct werd berekend ==> werd hierdoor te hoog berekend.\n* Berekening op basis van het grondvlak."]
["2019-01-22","afdrukversie optimaliseren"]
["2019-02-27","vloeibare opslag V-put","bij niveauberekening is het tan i.p.v. cos"]