{"text_format":"1","workbook":"xlsx","n_sheets":6,"sheets":["vloeibare mestopslag","vaste mestopslag","Blad3","Samenvatting opslagen","Afdrukversie","versiebeheer"],"not_rendered":{"charts":0,"images":6,"macros":1,"external_links":0,"defined_names":3,"comments":0,"pivot_tables":0},"unopened":[],"bounds":{"document_bytes":16777216,"sheet_cells":100000,"rows_first":2000,"rows_last":500,"rows_between":2000,"halvings":0,"cell_chars":16384,"cell_head_chars":4096},"cells_cut":0,"cells_raw":0,"read":"whole","date_system":"1900"}

{"sheet":"vloeibare mestopslag","index":0,"n_rows":82,"n_cols":64,"rows_kept":82,"cut":false,"hidden":false,"merged":[[66,10,66,11],[11,10,11,11],[12,10,12,11],[13,10,13,11],[25,10,25,11],[26,10,26,11],[27,10,27,11],[43,10,43,11],[44,10,44,11],[45,10,45,11],[64,10,64,11],[65,10,65,11],[61,17,63,19],[57,17,59,19],[19,0,19,1],[37,0,37,1],[36,17,38,19],[53,0,53,1],[35,0,35,1],[36,0,36,1],[51,0,51,1],[52,0,52,1],[0,15,1,16],[5,0,5,1],[6,0,6,1],[17,0,17,1],[18,0,18,1],[0,0,1,13],[7,0,7,1]]}
["Vloeibare mestopslag",null,null,null,null,null,null,null,null,null,null,null,null,null,null,"Totale opslag vloeibare mest",null,"Capaciteit","Opgeslagen","Inhoud N","Inhoud P2O5",null,null,null,null,null,null,null,null,null,null,null,null,null,null,null,null,null,null,null,null,null,null,null,null,null,null,null,"volgnummer","a =","a1 =","b =","b1 =","h =","h1 =","of h2 =","d =","of R =","omtrek =","inhoud =","L =","hoek ß=","Capaciteit","inhoud"]
[null,null,null,null,null,null,null,null,null,null,null,null,null,null,null,null,null,{"$f":"'Samenvatting opslagen'!Q94","v":0},{"$f":"'Samenvatting opslagen'!R94","v":0},{"$f":"'Samenvatting opslagen'!S94","v":0},{"$f":"'Samenvatting opslagen'!T94","v":0}]
[null,null,null,null,"a",null,null,null,null,null,null,null,null,null,null,null,null,null,null,{"$f":"IF(('Samenvatting opslagen'!B95-'Samenvatting opslagen'!S95)<>0,\"niet alle inhoudswaarden N werden opgegeven\",\"\")","v":""},{"$f":"IF(('Samenvatting opslagen'!B95-'Samenvatting opslagen'!T95)<>0,\"niet alle inhoudswaarden P2O5 werden opgegeven\",\"\")","v":""}]
["Rechthoekig",null,null,null,null,null,null,null,null,null,"meter",null,null,"Capaciteit",null,"Opgeslagen",null,"formule",null,null,null,null,null,null,"h2",null,null,null,null,null,null,null,null,null,1,"rechthoekige opslagput 1"]
[null,null,"     b",null,null,null,null,"h1 =",null,"a =",null,null,null,null,null,null,null,null,null,null,null,null,null,null,"h1 en h2 zijn beide ingevuld ==> er zal enekel met h1 gerekend worden",null,null,null,null,null,null,null,null,null,2,"rechthoekige opslagput 2"]
["volgnummer:",null,null,null,null,null,null,null,null,"b =",null,null,null,{"$f":"K5*K6*K7","v":0},null,{"$f":"IF(K5*K6*IF(K9=\"\",K10,K7-K9)<0,0,K5*K6*IF(K9=\"\",K10,K7-K9))","v":0},null,"a*b*h",null,null,null,null,null,null,null,null,null,null,null,null,null,null,null,null,3,"rechthoekige opslagput 3"]
[1,null,null,null,null,null,null,"h",null,"h =",null,null,null,null,null,null,null,null,null,null,null,null,null,null,{"$f":"A4&\" \"&A7","v":"Rechthoekig 1"},null,null,null,null,null,null,null,null,null,4,"rechthoekige opslagput 4"]
["(max 20 opslagen)",null,null,null,null,null,null,"h2",null,null,null,null,null,null,null,null,null,null,null,null,null,null,null,null,null,null,null,null,null,null,null,null,null,null,5,"rechthoekige opslagput 5"]
[null,null,null,null,null,null,null,null,null,"h1 =",null,null,null,null,null,null,{"$f":"IF(OR(K9>K7,K10>K7),\"De waarde van h1 of h2 kan niet groter zijn dan h\",\"\")","v":""},null,null,null,null,null,null,"naam opslagput = ",{"$f":"IF(K12=\"\",VLOOKUP(A7,AI4:AK23,2,),K12)","v":"rechthoekige opslagput 1"},null,null,null,null,null,null,null,null,null,6,"rechthoekige opslagput 6"]
[null,null,null,null,null,null,null,null,null,"of h2 =",null,null,null,null,null,null,{"$f":"IF(AND(K9<>\"\",K10<>\"\"),\"h1 en h2 zijn beide ingevuld ==> er zal enkel met h1 gerekend worden\",\"\")","v":""},null,null,null,null,null,null,"mestsoort =",{"$f":"IF(K13=\"ANDERE\",IF(K14=\"\",K13,K14),K13)","v":0},null,null,null,null,null,null,null,null,null,7,"rechthoekige opslagput 7"]
[null,null,null,null,null,null,null,null,null,null,null,null,null,null,null,null,null,null,null,null,null,null,null,"inhoud N =",{"$f":"IFERROR(IF(K13=\"ANDERE\",IF(N14=\"\",\"/\",N14*P6),N13*P6),\"/\")","v":"/"},null,null,null,null,null,null,null,null,null,8,"rechthoekige opslagput 8"]
[null,null,null,null,null,null,null,null,null,"naam opslag = ",null,null,null,{"$f":"IF(K13=\"\",\"\",\"inhoud N\")","v":""},null,{"$f":"IF(K13=\"\",\"\",\"inhoud P2O5\")","v":""},null,null,null,null,null,null,null,"inhoud P =",{"$f":"IFERROR(IF(K13=\"ANDERE\",IF(P14=\"\",\"/\",P14*P6),P13*P6),\"/\")","v":"/"},null,null,null,null,null,null,null,null,null,9,"rechthoekige opslagput 9"]
[null,null,null,null,null,null,null,null,null,"mestsoort =",null,null,null,{"$f":"IFERROR(VLOOKUP(K13,Blad3!E11:G25,2),\"\")","v":""},null,{"$f":"IFERROR(VLOOKUP(K13,Blad3!E11:G25,3),\"\")","v":""},null,null,null,null,null,null,null,null,null,null,null,null,null,null,null,null,null,null,10,"rechthoekige opslagput 10"]
[null,null,null,null,null,null,null,null,null,{"$f":"IF(K13=\"ANDERE\",\"Geef naam mestsoort en inhoud=\",\"\")","v":""},null,null,null,null,null,null,null,null,null,null,null,null,null,null,null,null,null,null,null,null,null,null,null,null,11,"rechthoekige opslagput 11"]
[null,null,null,null,null,null,null,null,null,null,null,null,null,null,null,null,null,null,null,null,null,null,null,null,null,null,null,null,null,null,null,null,null,null,12,"rechthoekige opslagput 12"]
["Citerne",null,null,null,null,null,null,null,null,null,"meter",null,null,"Capaciteit",null,"Opgeslagen",null,"formule",null,null,null,null,null,null,null,null,null,null,null,null,null,null,null,null,13,"rechthoekige opslagput 13"]
[null,null,null,null,null,null,null,null,null,"d =",null,"*",null,null,null,null,null,null,null,null,null,null,null,null,null,null,null,null,null,null,null,null,null,null,14,"rechthoekige opslagput 14"]
["volgnummer:",null,null,null,null,null,null,null,null,"of R =",null,"*",null,{"$f":"IF(K20<>\"\",K20,IF(AND(K17=\"\",K18=\"\"),(K19*K19)*K22/(4*PI()),IF(K17=\"\",K18*K18*K22*PI(),(K17/2)*(K17/2)*K22*PI())))","v":0},null,{"$f":"IF(K20<>\"\",K20/K22*IF(K23=\"\",K24,K22-K23),IF(AND(K17=\"\",K18=\"\"),(K19*K19)*IF(K23=\"\",K24,K22-K23)/(4*PI()),IF(K17=\"\",K18*K18*IF(K23=\"\",K24,K22-K23)*PI(),(K17/2)*(K17/2)*IF(K23=\"\",K24,K22-K23)*PI())))","v":0},null,"∏ * h * R²",null,null,null,null,null,null,null,null,null,null,null,null,null,null,null,null,15,"rechthoekige opslagput 15"]
[1,null,null,null,null,null,"h1",null,null," of omtrek =",null,"*",null,null,null,null,null,null,null,null,null,null,null,null,{"$f":"A16&\" \"&A19","v":"Citerne 1"},null,null,null,null,null,null,null,null,null,16,"rechthoekige opslagput 16"]
["(max 20 opslagen)",null,null,null,null,null,"   h",null,null,"of inhoud =",null,"*",null,null,null,null,null,null,null,null,null,null,null,null,null,null,null,null,null,null,null,null,null,null,17,"rechthoekige opslagput 17"]
[null,null,null,null,"d",null,null,null,null,null,null,null,null,null,null,null,null,null,null,null,null,null,null,null,null,null,null,null,null,null,null,null,null,null,18,"rechthoekige opslagput 18"]
[null,null,null,null,null,null,"h2",null,null,"h =",null,null,null,null,null,null,null,null,null,null,null,null,null,null,null,null,null,null,null,null,null,null,null,null,19,"rechthoekige opslagput 19"]
[null,null,null,null,null,null,null,null,null,"h1 =",null,null,null,null,null,null,{"$f":"IF(OR(K23>K22,K24>K22),\"De waarde van h1 of h2 kan niet groter zijn dan h\",\"\")","v":""},null,null,null,null,null,null,"naam opslagput = ",{"$f":"IF(K26=\"\",VLOOKUP(A19,AI24:AJ43,2,),K26)","v":"Citerne 1"},null,null,null,null,null,null,null,null,null,20,"rechthoekige opslagput 20"]
[null,null,null,null,null,null,null,null,null,"of h2 =",null,null,null,null,null,null,{"$f":"IF(AND(K23<>\"\",K24<>\"\"),\"h1 en h2 zijn beide ingevuld ==> er zal enkel met h1 gerekend worden\",\"\")","v":""},null,null,null,null,null,null,"mestsoort =",{"$f":"IF(K27=\"ANDERE\",IF(K28=\"\",K27,K28),K27)","v":0},null,null,null,null,null,null,null,null,null,1,"Citerne 1"]
[null,null,null,null,null,null,null,null,null,null,null,null,null,"* vul één van deze gegevens in.",null,null,null,null,null,null,null,null,null,"inhoud N =",{"$f":"IFERROR(IF(K27=\"ANDERE\",IF(N28=\"\",\"/\",N28*P18),N27*P18),\"/\")","v":"/"},null,null,null,null,null,null,null,null,null,2,"Citerne 2"]
[null,null,null,null,null,null,null,null,null,"naam opslag = ",null,null,null,{"$f":"IF(K27=\"\",\"\",\"inhoud N\")","v":""},null,{"$f":"IF(K27=\"\",\"\",\"inhoud P2O5\")","v":""},null,null,null,null,null,null,null,"inhoud P =",{"$f":"IFERROR(IF(K27=\"ANDERE\",IF(P28=\"\",\"/\",P28*P18),P27*P18),\"/\")","v":"/"},null,null,null,null,null,null,null,null,null,3,"Citerne 3"]
[null,null,null,null,null,null,null,null,null,"mestsoort =",null,null,null,{"$f":"IFERROR(VLOOKUP(K27,Blad3!E$11:G$25,2),\"\")","v":""},null,{"$f":"IFERROR(VLOOKUP(K27,Blad3!E$11:G$25,3),\"\")","v":""},null,null,null,null,null,null,null,null,null,null,null,null,null,null,null,null,null,null,4,"Citerne 4"]
[null,null,null,null,null,null,null,null,null,{"$f":"IF(K27=\"ANDERE\",\"Geef naam mestsoort en inhoud=\",\"\")","v":""},null,null,null,null,null,null,null,null,null,null,null,null,null,null,null,null,null,null,null,null,null,null,null,null,5,"Citerne 5"]
[null,null,null,null,null,null,null,null,null,null,null,null,null,null,null,null,null,null,null,null,null,null,null,null,null,null,null,null,null,null,null,null,null,null,6,"Citerne 6"]
[null,null,null,null,null,null,null,null,null,null,null,null,null,null,null,null,null,null,null,null,null,null,null,null,null,null,null,null,null,null,null,null,null,null,7,"Citerne 7"]
[null,null,null,null,null,null,null,null,null,null,null,null,null,null,null,null,null,null,null,null,null,null,null,null,null,null,null,null,null,null,null,null,null,null,8,"Citerne 8"]
["V-put",null,null,null,null,null,"a",null,null,null,null,null,null,null,null,null,null,null,null,null,null,null,null,null,null,null,null,null,null,null,null,null,null,null,9,"Citerne 9"]
[null,null,null,null,null,null,null,null,null,null,"meter",null,null,"Capaciteit",null,"Opgeslagen",null,"formule",null,null,null,null,null,null,null,null,null,null,null,null,null,null,null,null,10,"Citerne 10"]
[null,null,null,"L",null,null,null,null,null,"a =",null,null,null,null,null,null,null,null,null,null,null,null,null,null,null,null,null,null,null,null,null,null,null,null,11,"Citerne 11"]
[null,null,null,null,null,null,null,null,"   h1","b =",null,"*",null,{"$f":"IFERROR(K37*(K34+AA35)/2*K38,0)","v":0},null,{"$f":"IFERROR(IF(AND(K40=\"\",K41=\"\"),0,K37*(K34+AA35)/2*K38-AA41*(K34+AA36)/2*K38),0)","v":0},null,"h*(A+B)/2*L",null,null,null,null,null,null,null,"b =",{"$f":"IF(AND(K35=\"\",K42=\"\"),\"/\",IF(K35=\"\",K34-2*K37/TAN(RADIANS(AA42)),K35))","v":"/"},null,null,null,null,null,null,null,12,"Citerne 12"]
["volgnummer:",null,null,null,null,null,"b","          h",null,"b1 =",null,"*",null,null,null,null,null,null,null,null,null,null,null,null,null,"b1 =",{"$f":"K34-2*AA41/TAN(RADIANS(AA42))","v":{"$error":"#VALUE!"}},null,null,null,null,null,null,null,13,"Citerne 13"]
[1,null,null,null,null,null,null,null,"    h2","h =",null,null,null,null,null,null,null,"* als deze afmeteing niet gekend zijn laat je het veld leeg. De berekening gebeurt via de hoogte en de hoek",null,null,null,null,null,null,{"$f":"A32&\" \"&A37","v":"V-put 1"},null,null,null,null,null,null,null,null,null,14,"Citerne 14"]
["(max 20 opslagen)",null,null,null,null,null,null,null,null,"L =",null,null,null,null,null,null,null,null,null,null,null,null,null,null,null,null,null,null,null,null,null,null,null,null,15,"Citerne 15"]
[null,null,null,null,null,null,"b",null,null,null,null,null,null,null,null,null,null,null,null,null,null,null,null,null,null,null,null,null,null,null,null,null,null,null,16,"Citerne 16"]
[null,null,null,null,null,null,null,null,null,"h1 =",null,null,null,null,null,null,{"$f":"IF(OR(K40>K37,K41>K37),\"De waarde van h1 of h2 kan niet groter zijn dan h\",\"\")","v":""},null,null,null,null,null,null,null,null,null,null,null,null,null,null,null,null,null,17,"Citerne 17"]
[null,null,null,null,null,null,null,null,null,"of h2 =",null,null,null,null,null,null,{"$f":"IF(AND(K40<>\"\",K41<>\"\"),\"h1 en h2 zijn beide ingevuld ==> er zal enkel met h1 gerekend worden\",\"\")","v":""},null,null,null,null,null,null,"naam opslagput = ",{"$f":"IF(K44=\"\",VLOOKUP(A37,AI42:AK61,2,),K44)","v":"V put 1"},"h1 =",{"$f":"IF(K40=\"\",K37-K41,K40)","v":0},null,null,null,null,null,null,null,18,"Citerne 18"]
[null,null,null,null,null,null,null,null,null,"hoek ß=",null,{"$f":"IF(AND(K34<>\"\",K35=\"\",K42=\"\"),\"Gelieve een hoek in te vullen\",\"\")","v":""},null,null,null,null,null,null,null,null,null,null,null,"mestsoort =",{"$f":"IF(K45=\"ANDERE\",IF(K46=\"\",K45,K46),K45)","v":0},"hoek =",{"$f":"IF(AND(K42=\"\",K35=\"\"),\"/\",IF(K42=\"\",DEGREES(ATAN(K37/((K34-AA35)/2))),K42))","v":"/"},null,null,null,null,null,null,null,19,"Citerne 19"]
[null,null,null,null,null,null,null,null,null,null,null,null,null,null,null,null,null,null,null,null,null,null,null,"inhoud N =",{"$f":"IFERROR(IF(K45=\"ANDERE\",IF(N46=\"\",\"/\",N46*P35),N45*P35),\"/\")","v":"/"},null,null,null,null,null,null,null,null,null,20,"Citerne 20"]
[null,null,null,null,null,null,null,null,null,"naam opslag = ",null,null,null,{"$f":"IF(K45=\"\",\"\",\"inhoud N\")","v":""},null,{"$f":"IF(K45=\"\",\"\",\"inhoud P2O5\")","v":""},null,null,null,null,null,null,null,"inhoud P =",{"$f":"IFERROR(IF(K45=\"ANDERE\",IF(P46=\"\",\"/\",P46*P35),P45*P35),\"/\")","v":"/"},null,null,null,null,null,null,null,null,null,1,"V put 1"]
[null,null,null,null,null,null,null,null,null,"mestsoort =",null,null,null,{"$f":"IFERROR(VLOOKUP(K45,Blad3!E$11:G$25,2),\"\")","v":""},null,{"$f":"IFERROR(VLOOKUP(K45,Blad3!E$11:G$25,3),\"\")","v":""},null,null,null,null,null,null,null,null,null,null,null,null,null,null,null,null,null,null,2,"V put 2"]
[null,null,null,null,null,null,null,null,null,{"$f":"IF(K45=\"ANDERE\",\"Geef naam mestsoort en inhoud=\",\"\")","v":""},null,null,null,null,null,null,null,null,null,null,null,null,null,null,null,null,null,null,null,null,null,null,null,null,3,"V put 3"]
[null,null,null,null,null,null,null,null,null,null,null,null,null,null,null,null,null,null,null,null,null,null,null,null,null,null,null,null,null,null,null,null,null,null,4,"V put 4"]
[null,null,null,null,null,null,null,null,null,null,null,null,null,null,null,null,null,null,null,null,null,null,null,null,null,null,null,null,null,null,null,null,null,null,6,"V put 6"]
[null,null,null,null,null,null,null,null,null,null,null,null,null,null,null,null,null,null,null,null,null,null,null,null,null,null,null,null,null,null,null,null,null,null,7,"V put 7"]
["Lagune",null,null,null,null,"a",null,null,null,null,null,null,null,null,null,null,null,null,null,null,null,null,null,null,null,null,null,null,null,null,null,null,null,null,8,"V put 8"]
[null,null,null,null,null,null,null,null,null,null,"meter",null,null,"Capaciteit",null,"Opgeslagen",null,null,null,null,null,null,null,null,null,null,null,null,null,null,null,null,null,null,9,"V put 9"]
["volgnummer:",null,null,null,null,"   hs1",null,null,null,"a =",null,null,null,null,null,null,null,"1/3*h*(Ag+Ab+√(Ag*Ab))",null,"Brahmagupta □ en Heron Δ",null,null,null,null,null,"a =",{"$f":"IF(AND(K52=\"\",K53<>\"\"),K53+2*COS(RADIANS(K63))*AA61,K52)","v":0},null,null,null,null,null,null,null,10,"V put 10"]
[1,null,null,null,"H",null,"hs   ",null,"       b","a1 =",null,"*",null,{"$f":"IFERROR(1/3*AA62*(Y55+Y56+SQRT(Y55*Y56)),0)","v":0},null,{"$f":"IF(K62=\"\",0,IFERROR(1/3*AA62*(Y55+Y56+SQRT(Y55*Y56))-1/3*AA63*(Y56+Y57+SQRT(Y56*Y57)),0))","v":0},null,null,null,"s=1/2*(a+b+c+d)",null,null,null,null,{"$f":"A50&\" \"&A53","v":"Lagune 1"},"a1 =",{"$f":"IF(K53=\"\",K52-2*COS(RADIANS(K$63))*AA$61,K53)","v":{"$error":"#DIV/0!"}},"a2 =",{"$f":"AA52-2*COS(RADIANS(K$63))*K$62","v":0},null,null,null,null,null,11,"V put 11"]
["(max 20 opslagen)",null,null,"ß",null,null,null,null,null,"b =",null,null,null,null,null,null,null,null,null,"=√((s-a)*(s-b)*s-c)*(s-d))",null,null,null,null,null,"b =",{"$f":"IF(AND(K54=\"\",K55<>\"\"),K55+2*COS(RADIANS(K63))*AA61,K54)","v":0},null,null,null,null,null,null,null,12,"V put 12"]
[null,null,null,null,null,null,null,null,null,"b1 =",null,"*",null,null,null,null,null,"Ag =","oppervlakte grondvlak piramide",null,null,null,"opp onder",{"$f":"1/2*(AA53+AA55+AA57+AA59)","v":{"$error":"#DIV/0!"}},{"$f":"SQRT((X55-AA53)*(X55-AA55)*(X55-AA57)*(X55-AA59))","v":{"$error":"#DIV/0!"}},"b1 =",{"$f":"IF(K55=\"\",K54-2*COS(RADIANS(K$63))*AA$61,K55)","v":{"$error":"#DIV/0!"}},"b2 =",{"$f":"AA54-2*COS(RADIANS(K$63))*K$62","v":0},null,null,null,null,null,13,"V put 13"]
[null,null,null,null,null,null,null,null,null,"c =",null,"**",null,null,null,null,null,"Ab =","oppervlakte bovenvlak piramide",null,null,null,"opp boven",{"$f":"1/2*(AA52+AA54+AA56+AA58)","v":0},{"$f":"SQRT((X56-AA52)*(X56-AA54)*(X56-AA56)*(X56-AA58))","v":0},"c =",{"$f":"IF(AND(K56=\"\",K57<>\"\"),K57+2*COS(RADIANS(K63))*AA61,IF(K56=\"\",AA52,K56))","v":0},null,null,null,null,null,null,null,14,"V put 14"]
[null,null,null,null,null,null,null,null,null,"c1 =",null,"*",null,null,null,null,null,null,null,null,null,null,"opp niv",{"$f":"1/2*(AC53+AC55+AC57+AC59)","v":0},{"$f":"SQRT((X57-AC53)*(X57-AC55)*(X57-AC57)*(X57-AC59))","v":0},"c1 =",{"$f":"IF(K57=\"\",AA56-2*COS(RADIANS(K$63))*AA$61,K57)","v":{"$error":"#DIV/0!"}},"c2 =",{"$f":"AA56-2*COS(RADIANS(K$63))*K$62","v":0},null,null,null,null,null,15,"V put 15"]
["voor alle vierhoeken en driehoeken",null,null,null,null,null,null,null,null,"d =",null,"**",null,null,null,null,null,"* als deze afmeteing niet gekend zijn laat je het veld leeg. De berekening gebeurt via de hoogte en de hoek",null,null,null,null,null,null,null,"d =",{"$f":"IF(AND(K58=\"\",K59<>\"\"),K59+2*COS(RADIANS(K63))*AA61,IF(K58=\"\",AA54,K58))","v":0},null,null,null,null,null,null,null,16,"V put 16"]
[null,null,null,null,null,null,null,null,null,"d1 =",null,"*",null,null,null,null,null,null,null,null,null,null,null,null,null,"d1 =",{"$f":"IF(K59=\"\",AA58-2*COS(RADIANS(K$63))*AA$61,K59)","v":{"$error":"#DIV/0!"}},"d2 =",{"$f":"AA58-2*COS(RADIANS(K$63))*K$62","v":0},null,null,null,null,null,17,"V put 17"]
[null,null,null,null,null,null,null,null,null,"hs =",null,{"$f":"IF(AND(K60=\"\",K61<>\"\"),AA61,\"\")","v":""},null,null,null,null,null,null,null,null,null,null,null,null,null,null,null,null,null,null,null,null,null,null,18,"V put 18"]
[null,null,null,null,null,null,null,null,null,"of H =",null,{"$f":"IF(AND(K61=\"\",K60<>\"\"),AA62,IF(AND(K60<>\"\",K61<>\"\"),\"Er wordt enkel met de waarde hs gerekend en een waarde \"&ROUND(AA62,2)&\" als H\",\"\"))","v":""},null,null,null,null,null,null,null,null,null,null,null,null,null,"schuine zijde",{"$f":"IF(K60=\"\",K61/SIN(RADIANS(K63)),K60)","v":{"$error":"#DIV/0!"}},null,null,null,null,null,null,null,19,"V put 19"]
[null,null,null,null,null,null,null,null,null,"hs1 =",null,null,{"$f":"IF(K62=\"\",\"\",IF(IF(K60=\"\",K62>(K61/SIN(RADIANS(K63))),K62>K60),\"De waarde van hs1 kan niet groter zijn dan hs of H/sin(ß)\",\"\"))","v":""},null,null,null,null,"**als c en d blanco zijn worden de afmetingen a en b genomen",null,null,null,null,null,"naam opslagput = ",{"$f":"IF(K65=\"\",VLOOKUP(A53,AI63:AJ82,2,),K65)","v":"Lagune 1"},"hoogte",{"$f":"IF(K61=\"\",SIN(RADIANS(K63))*K60,IF(K60=\"\",K61,SIN(RADIANS(K63))*K60))","v":0},null,null,null,null,null,null,null,20,"V put 20"]
[null,null,null,null,null,null,null,null,null,"hoek ß=",null,null,null,null,null,null,null,null,null,null,null,null,null,"mestsoort =",{"$f":"IF(K66=\"ANDERE\",IF(K67=\"\",K66,K67),K66)","v":0},"hoogte niv",{"$f":"SIN(RADIANS(K63))*K62","v":0},null,null,null,null,null,null,null,1,"Lagune 1"]
[null,null,null,null,null,null,null,null,null,null,null,null,null,null,null,null,null,null,null,null,null,null,null,"inhoud N =",{"$f":"IFERROR(IF(K66=\"ANDERE\",IF(N67=\"\",\"/\",N67*P53),N66*P53),\"/\")","v":"/"},null,null,null,null,null,null,null,null,null,2,"Lagune 2"]
[null,null,null,null,null,null,null,null,null,"naam opslag = ",null,null,null,{"$f":"IF(K66=\"\",\"\",\"inhoud N\")","v":""},null,{"$f":"IF(K66=\"\",\"\",\"inhoud P2O5\")","v":""},null,null,null,null,null,null,null,"inhoud P =",{"$f":"IFERROR(IF(K66=\"ANDERE\",IF(P67=\"\",\"/\",P67*P53),P66*P53),\"/\")","v":"/"},null,null,null,null,null,null,null,null,null,3,"Lagune 3"]
[null,null,null,null,null,null,null,null,null,"mestsoort =",null,null,null,{"$f":"IFERROR(VLOOKUP(K66,Blad3!E$11:G$25,2),\"\")","v":""},null,{"$f":"IFERROR(VLOOKUP(K66,Blad3!E$11:G$25,3),\"\")","v":""},null,null,null,null,null,null,null,null,null,null,null,null,null,null,null,null,null,null,4,"Lagune 4"]
[null,null,null,null,null,null,null,null,null,{"$f":"IF(K66=\"ANDERE\",\"Geef naam mestsoort en inhoud=\",\"\")","v":""},null,null,null,null,null,null,null,null,null,null,null,null,null,null,null,null,null,null,null,null,null,null,null,null,5,"Lagune 5"]
[null,null,null,null,null,null,null,null,null,null,null,null,null,null,null,null,null,null,null,null,null,null,null,null,null,null,null,null,null,null,null,null,null,null,6,"Lagune 6"]
[null,null,null,null,null,null,null,null,null,null,null,null,null,null,null,null,null,null,null,null,null,null,null,null,null,null,null,null,null,null,null,null,null,null,7,"Lagune 7"]
[null,null,null,null,null,null,null,null,null,null,null,null,null,null,null,null,null,null,null,null,null,null,null,null,null,null,null,null,null,null,null,null,null,null,8,"Lagune 8"]
[null,null,null,null,null,null,null,null,null,null,null,null,null,null,null,null,null,null,null,null,null,null,null,null,null,null,null,null,null,null,null,null,null,null,9,"Lagune 9"]
[null,null,null,null,null,null,null,null,null,null,null,null,null,null,null,null,null,null,null,null,null,null,null,null,null,null,null,null,null,null,null,null,null,null,10,"Lagune 10"]
[null,null,null,null,null,null,null,null,null,null,null,null,null,null,null,null,null,null,null,null,null,null,null,null,null,null,null,null,null,null,null,null,null,null,11,"Lagune 11"]
[null,null,null,null,null,null,null,null,null,null,null,null,null,null,null,null,null,null,null,null,null,null,null,null,null,null,null,null,null,null,null,null,null,null,12,"Lagune 12"]
[null,null,null,null,null,null,null,null,null,null,null,null,null,null,null,null,null,null,null,null,null,null,null,null,null,null,null,null,null,null,null,null,null,null,13,"Lagune 13"]
[null,null,null,null,null,null,null,null,null,null,null,null,null,null,null,null,null,null,null,null,null,null,null,null,null,null,null,null,null,null,null,null,null,null,14,"Lagune 14"]
[null,null,null,null,null,null,null,null,null,null,null,null,null,null,null,null,null,null,null,null,null,null,null,null,null,null,null,null,null,null,null,null,null,null,15,"Lagune 15"]
[null,null,null,null,null,null,null,null,null,null,null,null,null,null,null,null,null,null,null,null,null,null,null,null,null,null,null,null,null,null,null,null,null,null,16,"Lagune 16"]
[null,null,null,null,null,null,null,null,null,null,null,null,null,null,null,null,null,null,null,null,null,null,null,null,null,null,null,null,null,null,null,null,null,null,17,"Lagune 17"]
[null,null,null,null,null,null,null,null,null,null,null,null,null,null,null,null,null,null,null,null,null,null,null,null,null,null,null,null,null,null,null,null,null,null,18,"Lagune 18"]
[null,null,null,null,null,null,null,null,null,null,null,null,null,null,null,null,null,null,null,null,null,null,null,null,null,null,null,null,null,null,null,null,null,null,19,"Lagune 19"]
[null,null,null,null,null,null,null,null,null,null,null,null,null,null,null,null,null,null,null,null,null,null,null,null,null,null,null,null,null,null,null,null,null,null,20,"Lagune 20"]

{"sheet":"vaste mestopslag","index":1,"n_rows":105,"n_cols":36,"rows_kept":105,"cut":false,"hidden":false,"merged":[[15,12,16,12],[15,13,16,13],[30,12,31,12],[30,13,31,13],[50,12,51,12],[50,13,51,13],[68,0,68,1],[66,0,66,1],[25,10,25,11],[26,10,26,11],[27,10,27,11],[44,10,44,11],[45,10,45,11],[46,10,46,11],[59,10,59,11],[60,10,60,11],[61,10,61,11],[34,0,34,1],[51,0,51,1],[52,0,52,1],[53,0,53,1],[67,0,67,1],[17,0,17,1],[18,0,18,1],[19,0,19,1],[32,0,32,1],[33,0,33,1],[0,0,1,13],[0,15,1,16],[5,0,5,1],[6,0,6,1],[7,0,7,1],[76,10,76,11],[22,7,23,7],[12,10,12,11],[10,10,10,11],[11,10,11,11],[74,10,74,11],[75,10,75,11]]}
["Vaste mestopslag",null,null,null,null,null,null,null,null,null,null,null,null,null,null,"Totale opslag vaste mest",null,"Capaciteit","Opgeslagen","Inhoud N","Inhoud P2O5"]
[null,null,null,null,null,null,null,null,null,null,null,null,null,null,null,null,null,{"$f":"'Samenvatting opslagen'!Q204","v":0},{"$f":"'Samenvatting opslagen'!R204","v":0},{"$f":"'Samenvatting opslagen'!S204","v":0},{"$f":"'Samenvatting opslagen'!T204","v":0}]
[null,null,null,null,null,"a"]
["Recht",null,null,null,null,null,null,null,null,null,"meter",null,null,"Capaciteit",null,"Opgeslagen",null,"formule",null,null,null,null,null,null,null,null,null,null,null,null,null,null,null,null,1,"Rechthoekig 1"]
[null,null,"     b",null,null,null,null,null,null,"a =",null,null,null,null,null,null,null,null,null,null,null,null,null,null,null,null,null,null,null,null,null,null,null,null,2,"Rechthoekig 2"]
["volgnummer:",null,null,null,null,null,null,null,null,"b =",null,null,null,{"$f":"K5*K6*K7","v":0},null,{"$f":"K5*K6*K9","v":0},null,"a*b*h",null,null,null,null,null,null,null,null,null,null,null,null,null,null,null,null,3,"Rechthoekig 3"]
[1,null,null,null,null,null,null,"h",null,"h =",null,null,null,null,null,null,null,null,null,null,null,null,null,null,null,null,null,null,null,null,null,null,null,null,4,"Rechthoekig 4"]
["(max 20 opslagen)",null,null,null,null,null,null,"h1 =",null,null,null,null,null,null,null,null,null,null,null,null,null,null,null,"naam opslagput = ",{"$f":"IF(K11=\"\",VLOOKUP(A7,AI4:AJ23,2,FALSE),K11)","v":"Rechthoekig 1"},null,null,null,null,null,null,null,null,null,5,"Rechthoekig 5"]
[null,null,null,null,null,null,null,null,null,"h1 =",null,null,null,null,null,null,null,null,null,null,null,null,null,"mestsoort =",{"$f":"IF(K12=\"ANDERE\",IF(K13=\"\",K12,K13),K12)","v":0},null,null,null,null,null,null,null,null,null,6,"Rechthoekig 6"]
[null,null,null,null,null,null,null,null,null,null,null,null,null,null,null,null,null,null,null,null,null,null,null,"inhoud N =",{"$f":"IFERROR(IF(K12=\"ANDERE\",IF(N13=\"\",\"/\",N13*P6),N12*P6),\"/\")","v":"/"},null,null,null,null,null,null,null,null,null,7,"Rechthoekig 7"]
[null,null,null,null,null,null,null,null,null,"naam opslag = ",null,null,null,{"$f":"IF(K12=\"\",\"\",\"inhoud N\")","v":""},null,{"$f":"IF(K12=\"\",\"\",\"inhoud P2O5\")","v":""},null,{"$f":"IF(K12=\"\",\"\",\"Dichtheid ton/m³\")","v":""},null,null,null,null,null,"inhoud P =",{"$f":"IFERROR(IF(K12=\"ANDERE\",IF(P13=\"\",\"/\",P13*P6),P12*P6),\"/\")","v":"/"},null,null,null,null,null,null,null,null,null,8,"Rechthoekig 8"]
[null,null,null,null,null,null,null,null,null,"mestsoort =",null,null,null,{"$f":"IFERROR(VLOOKUP(K12,Blad3!F31:I61,2,FALSE),\"\")","v":""},null,{"$f":"IFERROR(VLOOKUP(K12,Blad3!F31:I61,3,FALSE),\"\")","v":""},null,{"$f":"IFERROR(VLOOKUP(K12,Blad3!F31:I61,4,FALSE),\"\")","v":""},null,null,null,null,null,null,null,null,null,null,null,null,null,null,null,null,9,"Rechthoekig 9"]
[null,null,null,null,null,null,null,null,null,{"$f":"IF(K12=\"ANDERE\",\"Geef naam mestsoort en inhoud=\",\"\")","v":""},null,null,null,null,null,null,null,null,null,null,null,null,null,null,null,null,null,null,null,null,null,null,null,null,10,"Rechthoekig 10"]
[null,null,null,null,null,null,null,null,null,null,null,null,null,null,null,null,null,null,null,null,null,null,null,null,null,null,null,null,null,null,null,null,null,null,11,"Rechthoekig 11"]
[null,null,null,null,null,null,null,null,null,null,null,null,null,null,null,null,null,null,null,null,null,null,null,null,null,null,null,null,null,null,null,null,null,null,12,"Rechthoekig 12"]
["Hoop",null,null,null,null,null,null,null,null,null,null,null,"capaciteit meerekenen","Ja",null,null,null,null,null,null,null,null,null,null,null,null,null,null,null,null,null,null,null,null,13,"Rechthoekig 13"]
[null,null,null,null,null,null,null,null,null,null,null,null,null,null,null,null,null,null,null,null,null,null,null,null,null,null,null,null,null,null,null,null,null,null,14,"Rechthoekig 14"]
["volgnummer:",null,null,null,null,null,null,null,null,null,"meter",null,null,"Capaciteit",null,"Opgeslagen",null,"formule",null,null,null,null,null,null,null,null,null,null,null,null,null,null,null,null,15,"Rechthoekig 15"]
[1,null,null,null,null,null,null,null,null,"a =",null,null,null,null,null,null,null,null,null,null,null,null,null,null,null,null,null,null,null,null,null,null,null,null,16,"Rechthoekig 16"]
["(max 20 opslagen)",null,null,null,null,null,null,null,null,"b =",null,null,null,{"$f":"IF(N16=\"Nee\",0,1/3*X22*K23)","v":0},null,{"$f":"1/3*X22*K23","v":0},null,"1/3*Ag*h","Ag =","grond oppervlak piramide",null,null,null,null,null,null,null,null,null,null,null,null,null,null,17,"Rechthoekig 17"]
[null,null,null,null,null,null,null,null,null,"c =",null,"*",null,null,null,null,null,null,null,null,null,null,null,{"$f":"1/2*(K19+K20+AA21+AA22)","v":0},null,"c =",{"$f":"IF(K21=\"\",K19,K21)","v":0},null,null,null,null,null,null,null,18,"Rechthoekig 18"]
[null,null,null,null,null,null,null,null,null,"d =",null,"*",null,null,null,null,null,null,null,null,null,null,null,{"$f":"IF(K24<>\"\",PI()*K24*K24,SQRT((X21-K19)*(X21-K20)*(X21-AA21)*(X21-AA22)))","v":0},null,"d =",{"$f":"IF(K22=\"\",K20,K22)","v":0},null,null,null,null,null,null,null,19,"Rechthoekig 19"]
[null,null,null,null,null,null,null,null,null,"h =",null,null,null,null,null,null,null,null,null,null,null,null,null,"naam opslagput = ",{"$f":"IF(K26=\"\",VLOOKUP(A19,AI24:AJ43,2,FALSE),K26)","v":"Hoop 1"},null,null,null,null,null,null,null,null,null,20,"Rechthoekig 20"]
[null,null,null,null,null,null,null,null,null,"r =",null,null,null,null,null,null,null,null,null,null,null,null,null,"mestsoort =",{"$f":"IF(K27=\"ANDERE\",IF(K28=\"\",K27,K28),K27)","v":0},null,null,null,null,null,null,null,null,null,1,"Hoop 1"]
[null,null,null,null,null,null,null,null,null,{"$f":"+IF(AND(OR(K19<>\"\",K20<>\"\",K21<>\"\",K22<>\"\"),K24<>\"\"),\"Let op meerdere gegevens ingegeven. De berekening gebruikt voor een kegel met de straal\",\"\")","v":""},null,null,null,null,null,null,null,"* als c en d blanco zijn wordt a en b genomen",null,null,null,null,null,"inhoud N =",{"$f":"IFERROR(IF(K27=\"ANDERE\",IF(N28=\"\",\"/\",N28*P20/R28),N27*P20/R27),\"/\")","v":"/"},null,null,null,null,null,null,null,null,null,2,"Hoop 2"]
[null,null,null,null,null,null,null,null,null,"naam opslag = ",null,null,null,{"$f":"IF(K27=\"\",\"\",\"inhoud N\")","v":""},null,{"$f":"IF(K27=\"\",\"\",\"inhoud P2O5\")","v":""},null,{"$f":"IF(K27=\"\",\"\",\"Dichtheid ton/m³\")","v":""},null,null,null,null,null,"inhoud P =",{"$f":"IFERROR(IF(K27=\"ANDERE\",IF(P28=\"\",\"/\",P28*P20/R28),P27*P20/R27),\"/\")","v":"/"},null,null,null,null,null,null,null,null,null,3,"Hoop 3"]
["voor alle vierhoeken en driehoeken",null,null,null,null,null,null,null,null,"mestsoort =",null,null,null,{"$f":"IFERROR(VLOOKUP($K27,Blad3!$F$31:$I$61,2,FALSE),\"\")","v":""},null,{"$f":"IFERROR(VLOOKUP($K27,Blad3!$F$31:$I$61,3,FALSE),\"\")","v":""},null,{"$f":"IFERROR(VLOOKUP($K27,Blad3!$F$31:$I$61,4,FALSE),\"\")","v":""},null,null,null,null,null,null,null,null,null,null,null,null,null,null,null,null,4,"Hoop 4"]
[null,null,null,null,null,null,null,null,null,{"$f":"IF(K27=\"ANDERE\",\"Geef naam mestsoort en inhoud=\",\"\")","v":""},null,null,null,null,null,null,null,null,null,null,null,null,null,null,null,null,null,null,null,null,null,null,null,null,5,"Hoop 5"]
[null,null,null,null,null,null,null,null,null,null,null,null,null,null,null,null,null,null,null,null,null,null,null,null,null,null,null,null,null,null,null,null,null,null,6,"Hoop 6"]
[null,null,null,null,null,null,null,null,null,null,null,null,null,null,null,null,null,null,null,null,null,null,null,null,null,null,null,null,null,null,null,null,null,null,7,"Hoop 7"]
["Afgetopte hoop",null,null,null,null,null,null,null,null,null,null,null,"capaciteit meerekenen","Ja",null,null,null,null,null,null,null,null,null,null,null,null,null,null,null,null,null,null,null,null,8,"Hoop 8"]
[null,null,null,null,null,null,null,null,null,null,"meter",null,null,null,null,null,null,null,null,null,null,null,null,null,null,null,null,null,null,null,null,null,null,null,9,"Hoop 9"]
["volgnummer:",null,null,null,null,null,null,null,null,"a =",null,null,null,"Capaciteit",null,"Opgeslagen",null,"formule",null,null,null,null,null,null,null,null,null,null,null,null,null,null,null,null,10,"Hoop 10"]
[1,null,null,null,null,null,null,null,null,"a1 =",null,null,null,null,null,null,null,"1/3*h*(Ag+Ab+√(Ag*Ab))",null,"Brahmagupta □ en Heron Δ",null,null,null,null,null,null,null,null,null,null,null,null,null,null,11,"Hoop 11"]
["(max 20 opslagen)",null,null,null,null,null,null,null,null,"b =",null,null,null,{"$f":"IF(N31=\"Nee\",0,1/3*K41*IF(AND(K42<>\"\",K43<>\"\"),PI()*(K42*K42+K42*K43+K43*K43),(Y37+Y38+SQRT(Y37*Y38))))","v":0},null,{"$f":"1/3*K41*IF(AND(K42<>\"\",K43<>\"\"),PI()*(K42*K42+K42*K43+K43*K43),(Y37+Y38+SQRT(Y37*Y38)))","v":0},null,null,null,"s=1/2*(a+b+c+d)",null,null,null,null,null,"a1 =",{"$f":"K34","v":0},null,null,null,null,null,null,null,12,"Hoop 12"]
[null,null,null,null,null,null,null,null,null,"b1 =",null,null,null,null,null,null,null,null,null,"=√((s-a)*(s-b)*s-c)*(s-d))",null,null,null,null,null,null,null,null,null,null,null,null,null,null,13,"Hoop 13"]
[null,null,null,null,null,null,null,null,null,"c =",null,null,null,null,null,null,null,"Ab =","oppervlakte bovenvlak piramide",null,null,null,"opp onder",{"$f":"1/2*(AA35+AA37+AA39+AA41)","v":0},{"$f":"SQRT((X37-AA35)*(X37-AA37)*(X37-AA39)*(X37-AA41))","v":0},"b1 =",{"$f":"K36","v":0},null,null,null,null,null,null,null,14,"Hoop 14"]
[null,null,null,null,null,null,null,null,null,"c1 =",null,"*",null,null,null,null,null,"Ag =","oppervlakte grondvlak piramide",null,null,null,"opp boven",{"$f":"1/2*(K33+K35+AA38+AA40)","v":0},{"$f":"SQRT((X38-K33)*(X38-K35)*(X38-AA38)*(X38-AA40))","v":0},"c =",{"$f":"IF(K37=\"\",K33,K37)","v":0},null,null,null,null,null,null,null,15,"Hoop 15"]
[null,null,null,null,null,null,null,null,null,"d =",null,"*",null,null,null,null,null,null,null,null,null,null,null,null,null,"c1 =",{"$f":"IF(K38=\"\",K34,K38)","v":0},null,null,null,null,null,null,null,16,"Hoop 16"]
[null,null,null,null,null,null,null,null,null,"d1 =",null,"*",null,null,null,null,null,null,null,null,null,null,null,null,null,"d =",{"$f":"IF(K39=\"\",K35,K39)","v":0},null,null,null,null,null,null,null,17,"Hoop 17"]
[null,null,null,null,null,null,null,null,null,"h =",null,"*",null,null,null,null,null,null,null,null,null,null,null,null,null,"d1 =",{"$f":"IF(K40=\"\",K36,K40)","v":0},null,null,null,null,null,null,null,18,"Hoop 18"]
[null,null,null,null,null,null,null,null,null,"R =",null,null,null,null,null,null,null,null,null,null,null,null,null,"naam opslagput = ",{"$f":"IF(K45=\"\",VLOOKUP(A34,AI44:AJ63,2,FALSE),K45)","v":"Afgetopte hoop 1"},null,null,null,null,null,null,null,null,null,19,"Hoop 19"]
[null,null,null,null,null,null,null,null,null,"r =",null,null,null,"* als c, d, c1 en d1 blanco zijn wordt a, b, a1 en b1 genomen",null,null,null,null,null,null,null,null,null,"mestsoort =",{"$f":"IF(K46=\"ANDERE\",IF(K47=\"\",K46,K47),K46)","v":0},null,null,null,null,null,null,null,null,null,20,"Hoop 20"]
["voor alle vierhoeken en driehoeken",null,null,null,null,null,null,null,null,{"$f":"+IF(AND(OR(K33<>\"\",K35<>\"\",K37<>\"\",K39<>\"\"),K42<>\"\"),\"Let op meerdere gegevens ingegeven. De berekening gebruikt voor een kegel met de straal\",\"\")","v":""},null,null,null,null,null,null,null,null,null,null,null,null,null,"inhoud N =",{"$f":"IFERROR(IF(K46=\"ANDERE\",IF(N47=\"\",\"/\",N47*P35/R47),N46*P35/R46),\"/\")","v":"/"},null,null,null,null,null,null,null,null,null,1,"Afgetopte hoop 1"]
[null,null,null,null,null,null,null,null,null,"naam opslag = ",null,null,null,{"$f":"IF(K46=\"\",\"\",\"inhoud N\")","v":""},null,{"$f":"IF(K46=\"\",\"\",\"inhoud P2O5\")","v":""},null,{"$f":"IF(K46=\"\",\"\",\"Dichtheid ton/m³\")","v":""},null,null,null,null,null,"inhoud P =",{"$f":"IFERROR(IF(K46=\"ANDERE\",IF(P47=\"\",\"/\",P47*P35/R47),P46*P35/R46),\"/\")","v":"/"},null,null,null,null,null,null,null,null,null,2,"Afgetopte hoop 2"]
[null,null,null,null,null,null,null,null,null,"mestsoort =",null,null,null,{"$f":"IFERROR(VLOOKUP($K46,Blad3!$F$31:$I$61,2,FALSE),\"\")","v":""},null,{"$f":"IFERROR(VLOOKUP($K46,Blad3!$F$31:$I$61,3,FALSE),\"\")","v":""},null,{"$f":"IFERROR(VLOOKUP($K46,Blad3!$F$31:$I$61,4,FALSE),\"\")","v":""},null,null,null,null,null,null,null,null,null,null,null,null,null,null,null,null,3,"Afgetopte hoop 3"]
[null,null,null,null,null,null,null,null,null,{"$f":"IF(K46=\"ANDERE\",\"Geef naam mestsoort en inhoud=\",\"\")","v":""},null,null,null,null,null,null,null,null,null,null,null,null,null,null,null,null,null,null,null,null,null,null,null,null,4,"Afgetopte hoop 4"]
[null,null,null,null,null,null,null,null,null,null,null,null,null,null,null,null,null,null,null,null,null,null,null,null,null,null,null,null,null,null,null,null,null,null,5,"Afgetopte hoop 5"]
[null,null,null,null,null,null,null,null,null,null,null,null,null,null,null,null,null,null,null,null,null,null,null,null,null,null,null,null,null,null,null,null,null,null,6,"Afgetopte hoop 6"]
["Lange hoop",null,null,null,null,null,null,null,null,null,null,null,null,null,null,null,null,null,null,null,null,null,null,null,null,null,null,null,null,null,null,null,null,null,7,"Afgetopte hoop 7"]
[null,null,null,null,null,null,null,null,null,null,null,null,"capaciteit meerekenen","Ja",null,null,null,null,null,null,null,null,null,null,null,null,null,null,null,null,null,null,null,null,8,"Afgetopte hoop 8"]
["volgnummer:",null,null,null,null,null,null,null,null,null,"meter",null,null,null,null,null,null,null,null,null,null,null,null,null,null,null,null,null,null,null,null,null,null,null,9,"Afgetopte hoop 9"]
[1,null,null,null,null,null,null,null,null,"a =",null,null,null,"Capaciteit",null,"Opgeslagen",null,null,null,null,null,null,null,null,null,null,null,null,null,null,null,null,null,null,10,"Afgetopte hoop 10"]
["(max 20 opslagen)",null,null,null,null,null,null,null,null,"L =",null,null,null,null,null,null,null,"1/3*(L+L1+L2)*1/2*a*h",null,null,null,null,null,null,null,null,null,null,null,null,null,null,null,null,11,"Afgetopte hoop 11"]
[null,null,null,null,null,null,null,null,null,"L1 =",null,null,null,{"$f":"IF(N51=\"Nee\",0,1/3*(K54+K55+K56)*(1/2*K53*K57))","v":0},null,{"$f":"1/3*(K54+K55+K56)*(1/2*K53*K57)","v":0},null,null,null,null,null,null,null,"h =",{"$f":"K57/COS(RADIANS(#REF!))","v":{"$error":"#REF!"}},null,null,null,null,null,null,null,null,null,12,"Afgetopte hoop 12"]
[null,null,null,null,"        h",null,null,null,null,"L2 =",null,null,null,null,null,null,null,null,null,null,null,null,null,null,null,null,null,null,null,null,null,null,null,null,13,"Afgetopte hoop 13"]
[null,null,null,null,null,null,null,null,null,"h =",null,null,null,null,null,null,null,null,null,null,null,null,null,"naam opslagput = ",{"$f":"IF(K60=\"\",VLOOKUP(A53,AI64:AJ83,2,FALSE),K60)","v":"Lange hoop 1"},null,null,null,null,null,null,null,null,null,14,"Afgetopte hoop 14"]
[null,null,null,null,null,null,null,null,null,null,null,null,null,null,null,null,null,null,null,null,null,null,null,"mestsoort =",{"$f":"IF(K61=\"ANDERE\",IF(K62=\"\",K61,K62),K61)","v":0},null,null,null,null,null,null,null,null,null,15,"Afgetopte hoop 15"]
[null,null,null,null,null,null,null,null,null,null,null,null,null,null,null,null,null,null,null,null,null,null,null,"inhoud N =",{"$f":"IFERROR(IF(K61=\"ANDERE\",IF(N62=\"\",\"/\",N62*P55/R62),N61*P55/R61),\"/\")","v":"/"},null,null,null,null,null,null,null,null,null,16,"Afgetopte hoop 16"]
[null,null,null,null,null,null,null,null,null,"naam opslag = ",null,null,null,{"$f":"IF(K61=\"\",\"\",\"inhoud N\")","v":""},null,{"$f":"IF(K61=\"\",\"\",\"inhoud P2O5\")","v":""},null,{"$f":"IF(K61=\"\",\"\",\"Dichtheid ton/m³\")","v":""},null,null,null,null,null,"inhoud P =",{"$f":"IFERROR(IF(K61=\"ANDERE\",IF(P62=\"\",\"/\",P62*P55/R62),P61*P55/R61),\"/\")","v":"/"},null,null,null,null,null,null,null,null,null,17,"Afgetopte hoop 17"]
[null,null,null,null,null,null,null,null,null,"mestsoort =",null,null,null,{"$f":"IFERROR(VLOOKUP($K61,Blad3!$F$31:$I$61,2,FALSE),\"\")","v":""},null,{"$f":"IFERROR(VLOOKUP($K61,Blad3!$F$31:$I$61,3,FALSE),\"\")","v":""},null,{"$f":"IFERROR(VLOOKUP($K61,Blad3!$F$31:$I$61,4,FALSE),\"\")","v":""},null,null,null,null,null,null,null,null,null,null,null,null,null,null,null,null,18,"Afgetopte hoop 18"]
[null,null,null,null,null,null,null,null,null,{"$f":"IF(K61=\"ANDERE\",\"Geef naam mestsoort en inhoud=\",\"\")","v":""},null,null,null,null,null,null,null,null,null,null,null,null,null,null,null,null,null,null,null,null,null,null,null,null,19,"Afgetopte hoop 19"]
[null,null,null,null,null,null,null,null,null,null,null,null,null,null,null,null,null,null,null,null,null,null,null,null,null,null,null,null,null,null,null,null,null,null,20,"Afgetopte hoop 20"]
[null,null,null,null,null,null,null,null,null,null,null,null,null,null,null,null,null,null,null,null,null,null,null,null,null,null,null,null,null,null,null,null,null,null,1,"Lange hoop 1"]
["Mestvaalt",null,null,null,null,null,null,null,null,null,null,null,null,null,null,null,null,null,null,null,null,null,null,null,null,null,null,null,null,null,null,null,null,null,2,"Lange hoop 2"]
[null,null,null,null,null,null,null,null,null,null,null,null,null,null,null,null,null,null,null,null,null,null,null,null,null,null,null,null,null,null,null,null,null,null,3,"Lange hoop 3"]
["volgnummer:",null,null,null,null,null,null,null,null,null,null,null,null,null,null,null,null,null,null,null,null,null,null,null,null,null,null,null,null,null,null,null,null,null,4,"Lange hoop 4"]
[1,null,null,null,null,null,null,null,null,null,null,null,null,null,null,null,null,null,null,null,null,null,null,null,null,null,null,null,null,null,null,null,null,null,5,"Lange hoop 5"]
["(max 20 opslagen)",null,null,null,null,null,null,null,null,null,null,null,null,null,null,null,null,null,null,null,null,null,null,null,null,null,null,null,null,null,null,null,null,null,6,"Lange hoop 6"]
[null,null,null,null,null,null,null,null,null,null,"meter",null,null,"Capaciteit",null,null,null,null,null,null,null,null,null,null,null,null,null,null,null,null,null,null,null,null,7,"Lange hoop 7"]
[null,null,null,null,null,null,null,null,null,"a =",null,null,null,null,null,null,null,null,null,null,null,null,null,null,null,null,null,null,null,null,null,null,null,null,8,"Lange hoop 8"]
[null,null,null,null,null,null,null,null,null,"b =",null,null,null,{"$f":"K71*K72*K73","v":0},null,null,null,null,null,null,null,null,null,"naam opslagput = ",{"$f":"IF(K75=\"\",VLOOKUP(A68,AI79:AJ98,2,FALSE),K75)","v":"Mestvaalt 1"},null,null,null,null,null,null,null,null,null,9,"Lange hoop 9"]
[null,null,null,null,null,null,null,null,null,"h =",null,null,null,null,null,null,null,null,null,null,null,null,null,"mestsoort =",{"$f":"IF(K76=\"ANDERE\",IF(K77=\"\",K76,K77),K76)","v":0},null,null,null,null,null,null,null,null,null,10,"Lange hoop 10"]
[null,null,null,null,null,null,null,null,null,null,null,null,null,null,null,null,null,null,null,null,null,null,null,"inhoud N =",{"$f":"IFERROR(IF(K76=\"ANDERE\",IF(N77=\"\",\"/\",N77*N96/R77),N76*N96/R76),\"/\")","v":"/"},null,null,null,null,null,null,null,null,null,11,"Lange hoop 11"]
[null,null,null,null,null,null,null,null,null,"naam opslag = ",null,null,null,{"$f":"IF(K76=\"\",\"\",\"inhoud N\")","v":""},null,{"$f":"IF(K76=\"\",\"\",\"inhoud P2O5\")","v":""},null,{"$f":"IF(K76=\"\",\"\",\"Dichtheid ton/m³\")","v":""},null,null,null,null,null,"inhoud P =",{"$f":"IFERROR(IF(K76=\"ANDERE\",IF(P77=\"\",\"/\",P77*N96/R77),P76*N96/R76),\"/\")","v":"/"},null,null,null,null,null,null,null,null,null,12,"Lange hoop 12"]
[null,null,null,null,null,null,null,null,null,"mestsoort =",null,null,null,{"$f":"IFERROR(VLOOKUP($K76,Blad3!$F$31:$I$61,2,FALSE),\"\")","v":""},null,{"$f":"IFERROR(VLOOKUP($K76,Blad3!$F$31:$I$61,3,FALSE),\"\")","v":""},null,{"$f":"IFERROR(VLOOKUP($K76,Blad3!$F$31:$I$61,4,FALSE),\"\")","v":""},null,null,null,null,null,null,null,null,null,null,null,null,null,null,null,null,13,"Lange hoop 13"]
[null,null,null,null,null,null,null,null,null,{"$f":"IF(K76=\"ANDERE\",\"Geef naam mestsoort en inhoud=\",\"\")","v":""},null,null,null,null,null,null,null,null,null,null,null,null,null,null,null,null,null,null,null,null,null,null,null,null,14,"Lange hoop 14"]
[null,null,null,null,null,null,null,null,null,null,null,null,null,null,null,null,null,null,null,null,null,null,null,null,null,null,null,null,null,null,null,null,null,null,15,"Lange hoop 15"]
[null,null,null,null,null,null,null,null,null,null,"bepalen inhoud",null,null,null,null,null,null,null,null,null,null,null,null,null,null,null,null,null,null,null,null,null,null,null,16,"Lange hoop 16"]
[null,null,null,null,null,null,null,null,null,null,null,null,null,null,null,null,null,null,null,null,null,null,null,null,null,null,null,null,null,null,null,null,null,null,17,"Lange hoop 17"]
[null,null,null,null,null,null,null,null,null,null,null,null,null,null,null,null,null,null,null,null,null,null,null,null,null,null,null,null,null,null,null,null,null,null,18,"Lange hoop 18"]
[null,null,null,null,null,null,null,null,null,null,null,null,null,null,null,null,null,null,null,null,null,null,null,null,null,null,null,null,null,null,null,null,null,null,19,"Lange hoop 19"]
[null,null,null,null,null,null,null,null,null,null,null,null,null,null,null,null,null,null,null,null,null,null,null,null,null,null,null,null,null,null,null,null,null,null,20,"Lange hoop 20"]
[null,null,null,null,null,null,null,null,null,null,null,null,null,null,null,null,null,null,null,null,null,null,null,null,null,null,null,null,null,null,null,null,null,null,1,"Mestvaalt 1"]
[null,null,null,null,null,null,null,null,null,null,null,null,null,null,null,null,null,null,null,null,null,null,null,null,null,null,null,null,null,null,null,null,null,null,2,"Mestvaalt 2"]
[null,null,null,null,null,null,null,null,null,null,null,null,null,null,null,null,null,null,null,null,null,null,null,null,null,null,null,null,null,null,null,null,null,null,3,"Mestvaalt 3"]
[null,null,null,null,null,null,null,null,null,null,null,null,null,null,null,null,null,null,null,null,null,null,null,null,null,null,null,null,null,null,null,null,null,null,4,"Mestvaalt 4"]
[null,null,null,null,null,null,null,null,null,null,null,null,null,null,null,null,null,null,null,null,null,null,null,null,null,null,null,null,null,null,null,null,null,null,5,"Mestvaalt 5"]
[null,null,null,null,null,null,null,null,null,null,null,null,null,null,null,null,null,null,null,null,null,null,null,null,null,null,null,null,null,null,null,null,null,null,6,"Mestvaalt 6"]
[null,null,null,null,null,null,null,null,null,null,null,null,null,null,null,null,null,null,null,null,null,null,null,null,null,null,null,null,null,null,null,null,null,null,7,"Mestvaalt 7"]
[null,null,null,null,null,null,null,null,null,null,null,null,null,null,null,null,null,null,null,null,null,null,null,null,null,null,null,null,null,null,null,null,null,null,8,"Mestvaalt 8"]
[null,null,null,null,null,null,null,null,null,null,null,null,null,null,null,null,null,null,null,null,null,null,null,null,null,null,null,null,null,null,null,null,null,null,9,"Mestvaalt 9"]
[null,null,null,null,null,null,null,null,null,null,null,null,null,null,null,null,null,null,null,null,null,null,null,null,null,null,null,null,null,null,null,null,null,null,10,"Mestvaalt 10"]
[null,null,null,null,null,null,null,null,null,null,"meter",null,null,"Opgeslagen",null,"formule",null,null,null,null,null,null,null,null,null,null,null,null,null,null,null,null,null,null,11,"Mestvaalt 11"]
[null,null,null,null,null,null,null,null,null,"a =",null,null,null,null,null,"1/3*h*(Ag+Ab+√(Ag*Ab))",null,null,"Brahmagupta □ en Heron Δ",null,null,null,null,null,null,"a =",{"$f":"K95","v":0},null,null,null,null,null,null,null,12,"Mestvaalt 12"]
[null,null,null,null,null,null,null,null,null,"a1 =",null,null,null,{"$f":"IFERROR(1/3*K104*(Y98+Y99+SQRT(Y98*Y99))+1/3*K105*(Y99+Y100+SQRT(Y99*Y100)),0)","v":0},null,null,null,null,"s=1/2*(a+b+c+d)",null,null,null,null,null,null,"a1 =",{"$f":"K96","v":0},null,null,null,null,null,null,null,13,"Mestvaalt 13"]
[null,null,null,null,null,null,null,null,null,"b =",null,null,null,null,null,null,null,null,"=√((s-a)*(s-b)*s-c)*(s-d))",null,null,null,null,null,null,"b =",{"$f":"K97","v":0},null,null,null,null,null,null,null,14,"Mestvaalt 14"]
[null,null,null,null,null,null,null,null,null,"b1 =",null,null,null,null,null,null,null,"Ab =","oppervlakte bovenvlak piramide",null,null,"onder","opp onder",{"$f":"1/2*(AA95+AA97+AA95+AA101)","v":0},{"$f":"SQRT((X98-AA95)*(X98-AA97)*(X98-AA95)*(X98-AA101))","v":0},"b1 =",{"$f":"K98","v":0},null,null,null,null,null,null,null,15,"Mestvaalt 15"]
[null,null,null,null,null,null,null,null,null,"b2 =",null,null,null,null,null,null,null,"Ag =","oppervlakte grondvlak piramide",null,null,null,"opp boven",{"$f":"1/2*(AA95+AA98+AA95+AA102)","v":0},{"$f":"SQRT((X99-AA95)*(X99-AA98)*(X99-AA95)*(X99-AA102))","v":0},"b2 =",{"$f":"IF(K99=\"\",K95,K99)","v":0},null,null,null,null,null,null,null,16,"Mestvaalt 16"]
[null,null,null,null,null,null,null,null,null,"c1 =",null,"*",null,null,null,null,null,null,null,null,null,"top","opp bov bov",{"$f":"1/2*(AA96+AA99+AA100+AA103)","v":0},{"$f":"SQRT((X100-AA96)*(X100-AA99)*(X100-AA100)*(X100-AA103))","v":0},"c1 =",{"$f":"IF(K100=\"\",K96,K100)","v":0},null,null,null,null,null,null,null,17,"Mestvaalt 17"]
[null,null,null,null,null,null,null,null,null,"d =",null,"*",null,null,null,null,null,null,null,null,null,null,null,null,null,"d =",{"$f":"IF(K101=\"\",K97,K101)","v":0},null,null,null,null,null,null,null,18,"Mestvaalt 18"]
[null,null,null,null,null,null,null,null,null,"d1 =",null,"*",null,null,null,null,null,null,null,null,null,null,null,null,null,"d1 =",{"$f":"IF(K102=\"\",K98,K102)","v":0},null,null,null,null,null,null,null,19,"Mestvaalt 19"]
[null,null,null,null,null,null,null,null,null,"d2 =",null,"*",null,"* als d, c1, d1 of d2 blanco zijn wordt respectievelijk b, a1, b1 en b2 genomen",null,null,null,null,null,null,null,null,null,null,null,"d2 =",{"$f":"IF(K103=\"\",K99,K103)","v":0},null,null,null,null,null,null,null,20,"Mestvaalt 20"]
[null,null,null,null,null,null,null,null,null,"h ="]
[null,null,null,null,null,null,null,null,null,"h1 ="]

{"sheet":"Blad3","index":2,"n_rows":61,"n_cols":9,"rows_kept":61,"cut":false,"hidden":true,"merged":[[7,0,7,2],[7,4,7,6]]}
["Ja"]
["Nee"]
[]
[]
[]
["Vloeibaar"]
[]
["Mestsoort vloeibaar",null,null,null,"Mestsoort vloeibaar"]
[null,"N","P2O5",null,null,"N","P2O5"]
[null,"(kg/ton)","(kg/ton)",null,null,"(kg/ton)","(kg/ton)"]
["RUNDEREN",4.8,1.4,null,"ANDERE","",""]
["RUNDEREN (Gier)",4,0.2,null,"BIGGEN 7-20 KG",4.3,1.7]
["MESTKALVEREN",3,1.3,null,"KONIJNEN",8.5,13.5]
["BIGGEN 7-20 KG",4.3,1.7,null,"KONIJNEN (Gier)",1.4,0]
["ZEUGEN EN BIGGEN",3.2,1.4,null,"MESTKALVEREN",3,1.3]
["ZEUGEN EN BIGGEN (Gier)",2,0.9,null,"NERTSEN (Gier)",2,0.2]
["VLEESVARKENS",6.4,3.5,null,"OPFOKPOELJEN",9,8.3000000000000007]
["VLEESVARKENS (Gier)",5.8,0.9,null,"PAARDEN (Gier)",4,0.2]
["OPFOKPOELJEN",9,8.3000000000000007,null,"RUNDEREN",4.8,1.4]
["SCHAPEN (Gier)",4,0.2,null,"RUNDEREN (Gier)",4,0.2]
["PAARDEN (Gier)",4,0.2,null,"SCHAPEN (Gier)",4,0.2]
["NERTSEN (Gier)",2,0.2,null,"VLEESVARKENS",6.4,3.5]
["KONIJNEN",8.5,13.5,null,"VLEESVARKENS (Gier)",5.8,0.9]
["KONIJNEN (Gier)",1.4,0,null,"ZEUGEN EN BIGGEN",3.2,1.4]
["ANDERE",null,null,null,"ZEUGEN EN BIGGEN (Gier)",2,0.9]
[]
[]
[]
["VAST",null,null,null,null,null,"N","P2O5","Dichtheid"]
[null,null,null,null,null,null,"(kg/ton)","(kg/ton)","(ton/m³)"]
["RUNDEREN",null,null,null,null,"ANDER PLUIMVEE",17.399999999999999,19.3,0.5]
["ZEUGEN EN BIGGEN",null,null,null,null,"ANDERE"," "," "," "]
["VLEESVARKENS",null,null,null,null,"CHAMPOST",6.3,4,0.7]
["ANDER PLUIMVEE",null,null,null,null,"CHAMPOST EN VEEN",5.84,3.89,0.7]
["EENDEN",null,null,null,null,"DOORGROEIDE COMPOST CHAMPIGNONTELERS",7.5,4.4000000000000004,0.7]
["SLACHTKUIKENS VANAF 2011",null,null,null,null,"EENDEN",11,14,0.8]
["LEGHEN KOOI - RECHTSTREEKSE MESTAFVOER",null,null,null,null,"ENTBARE COMPOST VOOR CHAMPIGNONTELERS",6.2,3.7,0.7]
["LEGHEN KOOI - MESTOPSLAG IN LOODS",null,null,null,null,"GEITEN",6.6,3.5,0.8]
["LEGHEN KOOI - MESTOPSLAG IN LOODS+DROGING",null,null,null,null,"GEITEN (OP ROOSTERS)",7.5,4,0.8]
["LEGHEN SCHARREL OF VOLIERE",null,null,null,null,"GFT COMPOST",12,6,0.7]
["LEGHENOUDERDIER",null,null,null,null,"GROENCOMPOST",7,3,0.7]
["OPFOK LEGHEN KOOI",null,null,null,null,"KONIJNEN",16.899999999999999,13.8,0.8]
["OPFOK LEGHEN SCHARREL OF VOLIERE",null,null,null,null,"KONIJNEN (DEEPPIT STAL)",13.4,12.7,0.7]
["OPFOK SLACHTKUIKENOUDERDIEREN",null,null,null,null,"LEGHEN KOOI - MESTOPSLAG IN LOODS",26.9,21.3,0.8]
["SLACHTKUIKENOUDERDIEREN",null,null,null,null,"LEGHEN KOOI - MESTOPSLAG IN LOODS+DROGING",31.5,28.5,0.6]
["SCHAPEN",null,null,null,null,"LEGHEN KOOI - RECHTSTREEKSE MESTAFVOER",22.7,14.3,0.8]
["PAARDEN",null,null,null,null,"LEGHEN SCHARREL OF VOLIERE",19.8,27.4,0.5]
["GEITEN",null,null,null,null,"LEGHENOUDERDIER",19.8,27.4,0.5]
["NERTSEN",null,null,null,null,"NERTSEN",14.1,25.3,0.6]
["KONIJNEN",null,null,null,null,"OPFOK LEGHEN KOOI",23.6,14.6,0.8]
["KONIJNEN (DEEPPIT STAL)",null,null,null,null,"OPFOK LEGHEN SCHARREL OF VOLIERE",25,24.4,0.5]
["GEITEN (OP ROOSTERS)",null,null,null,null,"OPFOK SLACHTKUIKENOUDERDIEREN",19.8,26.2,0.5]
["VERSE COMPOST VOOR CHAMPIGNONTELERS",null,null,null,null,"PAARDEN",5,3,0.7]
["ENTBARE COMPOST VOOR CHAMPIGNONTELERS",null,null,null,null,"RUNDEREN",7.1,2.9,0.8]
["DOORGROEIDE COMPOST CHAMPIGNONTELERS",null,null,null,null,"SCHAPEN",8.3000000000000007,3.5,0.8]
["CHAMPOST",null,null,null,null,"SCHUIMAARDE",4.5,8,0.7]
["SCHUIMAARDE",null,null,null,null,"SLACHTKUIKENOUDERDIEREN",20.9,31.8,0.6]
["GFT COMPOST",null,null,null,null,"SLACHTKUIKENS VANAF 2011",27.1,14.1,0.5]
["GROENCOMPOST",null,null,null,null,"VERSE COMPOST VOOR CHAMPIGNONTELERS",5.0999999999999996,2.7,0.7]
["CHAMPOST EN VEEN",null,null,null,null,"VLEESVARKENS",7.5,9,0.8]
["ANDERE",null,null,null,null,"ZEUGEN EN BIGGEN",7.5,9,0.8]

{"sheet":"Samenvatting opslagen","index":3,"n_rows":204,"n_cols":73,"rows_kept":204,"cut":false,"hidden":false,"merged":[[2,8,2,9],[2,10,2,11],[3,8,3,9],[3,10,3,11],[0,0,0,20],[2,4,2,5],[3,4,3,5],[2,0,3,3],[2,6,2,7],[3,6,3,7],[9,0,9,20],[99,0,99,20],[7,53,7,71],[5,8,5,9],[5,10,5,11],[6,8,6,9],[6,10,6,11],[5,0,6,3],[5,4,5,5],[5,6,5,7],[6,4,6,5],[6,6,6,7]]}
["Samenvatting van alle opslagen op het bedrijf"]
[]
["Totale opslag vloeibare mest",null,null,null,"Capaciteit",null,"Opgeslagen",null,"Inhoud N",null,"Inhoud P2O5"]
[null,null,null,null,{"$f":"Q94","v":0},null,{"$f":"R94","v":0},null,{"$f":"S94","v":0},null,{"$f":"T94","v":0}]
[]
["Totale opslag vaste mest",null,null,null,"Capaciteit",null,"Opgeslagen",null,"Inhoud N",null,"Inhoud P2O5"]
[null,null,null,null,{"$f":"Q204","v":0},null,{"$f":"R204","v":0},null,{"$f":"S204","v":0},null,{"$f":"T204","v":0}]
[null,null,null,null,null,null,null,null,null,null,null,null,null,null,null,null,null,null,null,null,null,null,null,null,null,null,null,null,null,null,null,null,null,null,null,null,null,null,null,null,null,null,null,null,null,null,null,null,null,null,null,null,null,"afdruk versie"]
[null,null,null,null,null,null,null,null,null,null,null,null,null,null,null,null,null,null,null,null,null,null,null,null,null,null,2,3,4,5,6,7,8,9,10,11,12,13,14,15,16,17,18,19,20,21]
["Overzicht vloeibare mestopslag",null,null,null,null,null,null,null,null,null,null,null,null,null,null,null,null,null,null,null,null,null,null,null,null,{"$f":"IF(A10<>\"\",Z9+1,Z9)","v":1},{"$f":"IF(A10=\"\",\"\",A10)","v":"Overzicht vloeibare mestopslag"},"","","","","","","","","","","","","","","","","","","",1,null,null,null,null,null,null,{"$f":"IFERROR(VLOOKUP($AU10,$Z$10:$AT$203,AA$9,FALSE),\"/\")","v":"Overzicht vloeibare mestopslag"},{"$f":"IFERROR(VLOOKUP($AU10,$Z$10:$AT$203,AB$9,FALSE),\"\")","v":""},{"$f":"IFERROR(VLOOKUP($AU10,$Z$10:$AT$203,AC$9,FALSE),\"\")","v":""},{"$f":"IFERROR(VLOOKUP($AU10,$Z$10:$AT$203,AD$9,FALSE),\"\")","v":""},{"$f":"IFERROR(VLOOKUP($AU10,$Z$10:$AT$203,AE$9,FALSE),\"\")","v":""},{"$f":"IFERROR(VLOOKUP($AU10,$Z$10:$AT$203,AF$9,FALSE),\"\")","v":""},{"$f":"IFERROR(VLOOKUP($AU10,$Z$10:$AT$203,AG$9,FALSE),\"\")","v":""},{"$f":"IFERROR(VLOOKUP($AU10,$Z$10:$AT$203,AH$9,FALSE),\"\")","v":""},{"$f":"IFERROR(VLOOKUP($AU10,$Z$10:$AT$203,AI$9,FALSE),\"\")","v":""},{"$f":"IFERROR(VLOOKUP($AU10,$Z$10:$AT$203,AJ$9,FALSE),\"\")","v":""},{"$f":"IFERROR(VLOOKUP($AU10,$Z$10:$AT$203,AK$9,FALSE),\"\")","v":""},{"$f":"IFERROR(VLOOKUP($AU10,$Z$10:$AT$203,AL$9,FALSE),\"\")","v":""},{"$f":"IFERROR(VLOOKUP($AU10,$Z$10:$AT$203,AM$9,FALSE),\"\")","v":""},{"$f":"IFERROR(VLOOKUP($AU10,$Z$10:$AT$203,AN$9,FALSE),\"\")","v":""},{"$f":"IFERROR(VLOOKUP($AU10,$Z$10:$AT$203,AO$9,FALSE),\"\")","v":""},{"$f":"IFERROR(VLOOKUP($AU10,$Z$10:$AT$203,AP$9,FALSE),\"\")","v":""},{"$f":"IFERROR(VLOOKUP($AU10,$Z$10:$AT$203,AQ$9,FALSE),\"\")","v":""},{"$f":"IFERROR(VLOOKUP($AU10,$Z$10:$AT$203,AR$9,FALSE),\"\")","v":""},{"$f":"IFERROR(VLOOKUP($AU10,$Z$10:$AT$203,AS$9,FALSE),\"\")","v":""}]
[null,null,null,null,null,null,null,null,null,null,null,null,null,null,null,null,null,null,null,null,null,null,null,null,null,{"$f":"IF(A11<>\"\",Z10+1,Z10)","v":1},{"$f":"IF(A11=\"\",\"\",A11)","v":""},"",{"$f":"IF(C11=\"\",\"\",C11)","v":""},{"$f":"IF(D11=\"\",\"\",D11)","v":""},{"$f":"IF(E11=\"\",\"\",E11)","v":""},{"$f":"IF(F11=\"\",\"\",F11)","v":""},{"$f":"IF(G11=\"\",\"\",G11)","v":""},{"$f":"IF(H11=\"\",\"\",H11)","v":""},{"$f":"IF(I11=\"\",\"\",I11)","v":""},{"$f":"IF(J11=\"\",\"\",J11)","v":""},{"$f":"IF(K11=\"\",\"\",K11)","v":""},{"$f":"IF(L11=\"\",\"\",L11)","v":""},{"$f":"IF(M11=\"\",\"\",M11)","v":""},{"$f":"IF(N11=\"\",\"\",N11)","v":""},{"$f":"IF(O11=\"\",\"\",O11)","v":""},{"$f":"IF(P11=\"\",\"\",P11)","v":""},{"$f":"IF(Q11=\"\",\"\",Q11)","v":""},{"$f":"IF(R11=\"\",\"\",R11)","v":""},{"$f":"IF(S11=\"\",\"\",S11)","v":""},{"$f":"IF(T11=\"\",\"\",T11)","v":""},2,null,null,null,null,null,null,{"$f":"IFERROR(VLOOKUP($AU11,$Z$10:$AT$203,AA$9,FALSE),\"/\")","v":"ingegeven opslagen"},"","","","","","","hs =","H =","hs1 =","c =","c1 =","d =","d1 =","","","","","",{"$f":"IFERROR(VLOOKUP('Samenvatting opslagen'!$AU11,'Samenvatting opslagen'!$Z$10:$AT$203,'Samenvatting opslagen'!BV$9,FALSE),\"\")","v":""}]
["ingegeven opslagen",null,null,null,null,null,null,"hs =","H =","hs1 =","c =","c1 =","d =","d1 =",null,null,null,null,null,null,null,null,null,null,null,{"$f":"IF(A12<>\"\",Z11+1,Z11)","v":2},"ingegeven opslagen","","","","","","","hs =","H =","hs1 =","c =","c1 =","d =","d1 =","","","","","","",3,null,null,null,null,null,null,"volgnummer","Naam opslag","mestsoort","a =","a1 =","b =","b1 =","h =","h1 =","of h2 =","d =","of R =","omtrek =","inhoud =","L =","hoek ß=","Capaciteit","inhoud","inhoud N","inhoud P2O5"]
["volgnummer","Naam opslag","mestsoort","a =","a1 =","b =","b1 =","h =","h1 =","of h2 =","d =","of R =","omtrek =","inhoud =","L =","hoek ß=","Capaciteit","inhoud","inhoud N","inhoud P2O5",null,null,null,null,null,{"$f":"IF(A13<>\"\",Z12+1,Z12)","v":3},"volgnummer","Naam opslag","mestsoort","a =","a1 =","b =","b1 =","h =","h1 =","of h2 =","d =","of R =","omtrek =","inhoud =","L =","hoek ß=","Capaciteit","inhoud","inhoud N","inhoud P2O5",4,null,null,null,null,null,null,"Overzicht vaste mestopslag","","","","","","","","","","","","","","","","","","",""]
[1,null,null,null,null,null,null,null,null,null,null,null,null,null,null,null,null,null,null,null,2,"rechthoekig 1",null,{"$f":"IFERROR(VLOOKUP($C14,Blad3!$E$11:$E$25,1,FALSE),IF($C14<>\"\",\"ANDERE\",\"\"))","v":""},{"$f":"IF(ISERROR(VLOOKUP($C14,Blad3!$E$11:$E$25,1,FALSE)),IF($C14<>\"\",$C14,\"\"),\"\")","v":""},{"$f":"IF(B14<>\"\",Z13+1,Z13)","v":3},{"$f":"IF(V14=\"\",\"\",V14)","v":"rechthoekig 1"},{"$f":"IF(B14=\"\",\"\",B14)","v":""},"","","","","","","","","","","","","","","","","","",5,null,null,null,null,null,null,"ingegeven opslagen","","","","","","","","","","","L =","L1 =","L2 =","","r =","","","",""]
[2,null,null,null,null,null,null,null,null,null,null,null,null,null,null,null,null,null,null,null,3,"rechthoekig 2",null,{"$f":"IFERROR(VLOOKUP($C15,Blad3!$E$11:$E$25,1,FALSE),IF($C15<>\"\",\"ANDERE\",\"\"))","v":""},{"$f":"IF(ISERROR(VLOOKUP($C15,Blad3!$E$11:$E$25,1,FALSE)),IF($C15<>\"\",$C15,\"\"),\"\")","v":""},3,"rechthoekig 2","","","","","","","","","","","","","","","","","","","",6,null,null,null,null,null,null,"volgnummer","Naam opslag","mestsoort","a =","a1 =","b =","b1 =","h =","h1 =","c =","c1 =","d =","d1 =","d2 =","R =","","Capaciteit","inhoud","inhoud N","inhoud P2O5"]
[3,null,null,null,null,null,null,null,null,null,null,null,null,null,null,null,null,null,null,null,4,"rechthoekig 3",null,{"$f":"IFERROR(VLOOKUP($C16,Blad3!$E$11:$E$25,1,FALSE),IF($C16<>\"\",\"ANDERE\",\"\"))","v":""},{"$f":"IF(ISERROR(VLOOKUP($C16,Blad3!$E$11:$E$25,1,FALSE)),IF($C16<>\"\",$C16,\"\"),\"\")","v":""},3,"rechthoekig 3","","","","","","","","","","","","","","","","","","","",7,null,null,null,null,null,null,"/","","","","","","","","","","","","","","","","","","",""]
[4,null,null,null,null,null,null,null,null,null,null,null,null,null,null,null,null,null,null,null,5,"rechthoekig 4",null,{"$f":"IFERROR(VLOOKUP($C17,Blad3!$E$11:$E$25,1,FALSE),IF($C17<>\"\",\"ANDERE\",\"\"))","v":""},{"$f":"IF(ISERROR(VLOOKUP($C17,Blad3!$E$11:$E$25,1,FALSE)),IF($C17<>\"\",$C17,\"\"),\"\")","v":""},3,"rechthoekig 4","","","","","","","","","","","","","","","","","","","",8,null,null,null,null,null,null,"/","","","","","","","","","","","","","","","","","","",""]
[5,null,null,null,null,null,null,null,null,null,null,null,null,null,null,null,null,null,null,null,6,"rechthoekig 5",null,{"$f":"IFERROR(VLOOKUP($C18,Blad3!$E$11:$E$25,1,FALSE),IF($C18<>\"\",\"ANDERE\",\"\"))","v":""},{"$f":"IF(ISERROR(VLOOKUP($C18,Blad3!$E$11:$E$25,1,FALSE)),IF($C18<>\"\",$C18,\"\"),\"\")","v":""},3,"rechthoekig 5","","","","","","","","","","","","","","","","","","","",9,null,null,null,null,null,null,"/","","","","","","","","","","","","","","","","","","",""]
[6,null,null,null,null,null,null,null,null,null,null,null,null,null,null,null,null,null,null,null,7,"rechthoekig 6",null,{"$f":"IFERROR(VLOOKUP($C19,Blad3!$E$11:$E$25,1,FALSE),IF($C19<>\"\",\"ANDERE\",\"\"))","v":""},{"$f":"IF(ISERROR(VLOOKUP($C19,Blad3!$E$11:$E$25,1,FALSE)),IF($C19<>\"\",$C19,\"\"),\"\")","v":""},3,"rechthoekig 6","","","","","","","","","","","","","","","","","","","",10,null,null,null,null,null,null,"/","","","","","","","","","","","","","","","","","","",""]
[7,null,null,null,null,null,null,null,null,null,null,null,null,null,null,null,null,null,null,null,8,"rechthoekig 7",null,{"$f":"IFERROR(VLOOKUP($C20,Blad3!$E$11:$E$25,1,FALSE),IF($C20<>\"\",\"ANDERE\",\"\"))","v":""},{"$f":"IF(ISERROR(VLOOKUP($C20,Blad3!$E$11:$E$25,1,FALSE)),IF($C20<>\"\",$C20,\"\"),\"\")","v":""},3,"rechthoekig 7","","","","","","","","","","","","","","","","","","","",11,null,null,null,null,null,null,"/","","","","","","","","","","","","","","","","","","",""]
[8,null,null,null,null,null,null,null,null,null,null,null,null,null,null,null,null,null,null,null,9,"rechthoekig 8",null,{"$f":"IFERROR(VLOOKUP($C21,Blad3!$E$11:$E$25,1,FALSE),IF($C21<>\"\",\"ANDERE\",\"\"))","v":""},{"$f":"IF(ISERROR(VLOOKUP($C21,Blad3!$E$11:$E$25,1,FALSE)),IF($C21<>\"\",$C21,\"\"),\"\")","v":""},3,"rechthoekig 8","","","","","","","","","","","","","","","","","","","",12,null,null,null,null,null,null,"/","","","","","","","","","","","","","","","","","","",""]
[9,null,null,null,null,null,null,null,null,null,null,null,null,null,null,null,null,null,null,null,10,"rechthoekig 9",null,{"$f":"IFERROR(VLOOKUP($C22,Blad3!$E$11:$E$25,1,FALSE),IF($C22<>\"\",\"ANDERE\",\"\"))","v":""},{"$f":"IF(ISERROR(VLOOKUP($C22,Blad3!$E$11:$E$25,1,FALSE)),IF($C22<>\"\",$C22,\"\"),\"\")","v":""},3,"rechthoekig 9","","","","","","","","","","","","","","","","","","","",13,null,null,null,null,null,null,"/","","","","","","","","","","","","","","","","","","",""]
[10,null,null,null,null,null,null,null,null,null,null,null,null,null,null,null,null,null,null,null,11,"rechthoekig 10",null,{"$f":"IFERROR(VLOOKUP($C23,Blad3!$E$11:$E$25,1,FALSE),IF($C23<>\"\",\"ANDERE\",\"\"))","v":""},{"$f":"IF(ISERROR(VLOOKUP($C23,Blad3!$E$11:$E$25,1,FALSE)),IF($C23<>\"\",$C23,\"\"),\"\")","v":""},3,"rechthoekig 10","","","","","","","","","","","","","","","","","","","",14,null,null,null,null,null,null,"/","","","","","","","","","","","","","","","","","","",""]
[11,null,null,null,null,null,null,null,null,null,null,null,null,null,null,null,null,null,null,null,12,"rechthoekig 11",null,{"$f":"IFERROR(VLOOKUP($C24,Blad3!$E$11:$E$25,1,FALSE),IF($C24<>\"\",\"ANDERE\",\"\"))","v":""},{"$f":"IF(ISERROR(VLOOKUP($C24,Blad3!$E$11:$E$25,1,FALSE)),IF($C24<>\"\",$C24,\"\"),\"\")","v":""},3,"rechthoekig 11","","","","","","","","","","","","","","","","","","","",15,null,null,null,null,null,null,"/","","","","","","","","","","","","","","","","","","",""]
[12,null,null,null,null,null,null,null,null,null,null,null,null,null,null,null,null,null,null,null,13,"rechthoekig 12",null,{"$f":"IFERROR(VLOOKUP($C25,Blad3!$E$11:$E$25,1,FALSE),IF($C25<>\"\",\"ANDERE\",\"\"))","v":""},{"$f":"IF(ISERROR(VLOOKUP($C25,Blad3!$E$11:$E$25,1,FALSE)),IF($C25<>\"\",$C25,\"\"),\"\")","v":""},3,"rechthoekig 12","","","","","","","","","","","","","","","","","","","",16,null,null,null,null,null,null,"/","","","","","","","","","","","","","","","","","","",""]
[13,null,null,null,null,null,null,null,null,null,null,null,null,null,null,null,null,null,null,null,14,"rechthoekig 13",null,{"$f":"IFERROR(VLOOKUP($C26,Blad3!$E$11:$E$25,1,FALSE),IF($C26<>\"\",\"ANDERE\",\"\"))","v":""},{"$f":"IF(ISERROR(VLOOKUP($C26,Blad3!$E$11:$E$25,1,FALSE)),IF($C26<>\"\",$C26,\"\"),\"\")","v":""},3,"rechthoekig 13","","","","","","","","","","","","","","","","","","","",17,null,null,null,null,null,null,"/","","","","","","","","","","","","","","","","","","",""]
[14,null,null,null,null,null,null,null,null,null,null,null,null,null,null,null,null,null,null,null,15,"rechthoekig 14",null,{"$f":"IFERROR(VLOOKUP($C27,Blad3!$E$11:$E$25,1,FALSE),IF($C27<>\"\",\"ANDERE\",\"\"))","v":""},{"$f":"IF(ISERROR(VLOOKUP($C27,Blad3!$E$11:$E$25,1,FALSE)),IF($C27<>\"\",$C27,\"\"),\"\")","v":""},3,"rechthoekig 14","","","","","","","","","","","","","","","","","","","",18,null,null,null,null,null,null,"/","","","","","","","","","","","","","","","","","","",""]
[15,null,null,null,null,null,null,null,null,null,null,null,null,null,null,null,null,null,null,null,16,"rechthoekig 15",null,{"$f":"IFERROR(VLOOKUP($C28,Blad3!$E$11:$E$25,1,FALSE),IF($C28<>\"\",\"ANDERE\",\"\"))","v":""},{"$f":"IF(ISERROR(VLOOKUP($C28,Blad3!$E$11:$E$25,1,FALSE)),IF($C28<>\"\",$C28,\"\"),\"\")","v":""},3,"rechthoekig 15","","","","","","","","","","","","","","","","","","","",19,null,null,null,null,null,null,"/","","","","","","","","","","","","","","","","","","",""]
[16,null,null,null,null,null,null,null,null,null,null,null,null,null,null,null,null,null,null,null,17,"rechthoekig 16",null,{"$f":"IFERROR(VLOOKUP($C29,Blad3!$E$11:$E$25,1,FALSE),IF($C29<>\"\",\"ANDERE\",\"\"))","v":""},{"$f":"IF(ISERROR(VLOOKUP($C29,Blad3!$E$11:$E$25,1,FALSE)),IF($C29<>\"\",$C29,\"\"),\"\")","v":""},3,"rechthoekig 16","","","","","","","","","","","","","","","","","","","",20,null,null,null,null,null,null,"/","","","","","","","","","","","","","","","","","","",""]
[17,null,null,null,null,null,null,null,null,null,null,null,null,null,null,null,null,null,null,null,18,"rechthoekig 17",null,{"$f":"IFERROR(VLOOKUP($C30,Blad3!$E$11:$E$25,1,FALSE),IF($C30<>\"\",\"ANDERE\",\"\"))","v":""},{"$f":"IF(ISERROR(VLOOKUP($C30,Blad3!$E$11:$E$25,1,FALSE)),IF($C30<>\"\",$C30,\"\"),\"\")","v":""},3,"rechthoekig 17","","","","","","","","","","","","","","","","","","","",21,null,null,null,null,null,null,"/","","","","","","","","","","","","","","","","","","",""]
[18,null,null,null,null,null,null,null,null,null,null,null,null,null,null,null,null,null,null,null,19,"rechthoekig 18",null,{"$f":"IFERROR(VLOOKUP($C31,Blad3!$E$11:$E$25,1,FALSE),IF($C31<>\"\",\"ANDERE\",\"\"))","v":""},{"$f":"IF(ISERROR(VLOOKUP($C31,Blad3!$E$11:$E$25,1,FALSE)),IF($C31<>\"\",$C31,\"\"),\"\")","v":""},3,"rechthoekig 18","","","","","","","","","","","","","","","","","","","",22,null,null,null,null,null,null,"/","","","","","","","","","","","","","","","","","","",""]
[19,null,null,null,null,null,null,null,null,null,null,null,null,null,null,null,null,null,null,null,20,"rechthoekig 19",null,{"$f":"IFERROR(VLOOKUP($C32,Blad3!$E$11:$E$25,1,FALSE),IF($C32<>\"\",\"ANDERE\",\"\"))","v":""},{"$f":"IF(ISERROR(VLOOKUP($C32,Blad3!$E$11:$E$25,1,FALSE)),IF($C32<>\"\",$C32,\"\"),\"\")","v":""},3,"rechthoekig 19","","","","","","","","","","","","","","","","","","","",23,null,null,null,null,null,null,"/","","","","","","","","","","","","","","","","","","",""]
[20,null,null,null,null,null,null,null,null,null,null,null,null,null,null,null,null,null,null,null,1,"rechthoekig 20",null,{"$f":"IFERROR(VLOOKUP($C33,Blad3!$E$11:$E$25,1,FALSE),IF($C33<>\"\",\"ANDERE\",\"\"))","v":""},{"$f":"IF(ISERROR(VLOOKUP($C33,Blad3!$E$11:$E$25,1,FALSE)),IF($C33<>\"\",$C33,\"\"),\"\")","v":""},3,"rechthoekig 20","","","","","","","","","","","","","","","","","","","",24,null,null,null,null,null,null,"/","","","","","","","","","","","","","","","","","","",""]
[1,null,null,null,null,null,null,null,null,null,null,null,null,null,null,null,null,null,null,null,2,"Citerne 1",null,{"$f":"IFERROR(VLOOKUP($C34,Blad3!$E$11:$E$25,1,FALSE),IF($C34<>\"\",\"ANDERE\",\"\"))","v":""},{"$f":"IF(ISERROR(VLOOKUP($C34,Blad3!$E$11:$E$25,1,FALSE)),IF($C34<>\"\",$C34,\"\"),\"\")","v":""},3,"Citerne 1","","","","","","","","","","","","","","","","","","","",25,null,null,null,null,null,null,"/","","","","","","","","","","","","","","","","","","",""]
[2,null,null,null,null,null,null,null,null,null,null,null,null,null,null,null,null,null,null,null,3,"Citerne 2",null,{"$f":"IFERROR(VLOOKUP($C35,Blad3!$E$11:$E$25,1,FALSE),IF($C35<>\"\",\"ANDERE\",\"\"))","v":""},{"$f":"IF(ISERROR(VLOOKUP($C35,Blad3!$E$11:$E$25,1,FALSE)),IF($C35<>\"\",$C35,\"\"),\"\")","v":""},3,"Citerne 2","",{"$f":"IF(C35=\"\",\"\",C35)","v":""},{"$f":"IF(D35=\"\",\"\",D35)","v":""},{"$f":"IF(E35=\"\",\"\",E35)","v":""},{"$f":"IF(F35=\"\",\"\",F35)","v":""},{"$f":"IF(G35=\"\",\"\",G35)","v":""},{"$f":"IF(H35=\"\",\"\",H35)","v":""},{"$f":"IF(I35=\"\",\"\",I35)","v":""},{"$f":"IF(J35=\"\",\"\",J35)","v":""},{"$f":"IF(K35=\"\",\"\",K35)","v":""},{"$f":"IF(L35=\"\",\"\",L35)","v":""},{"$f":"IF(M35=\"\",\"\",M35)","v":""},{"$f":"IF(N35=\"\",\"\",N35)","v":""},{"$f":"IF(O35=\"\",\"\",O35)","v":""},{"$f":"IF(P35=\"\",\"\",P35)","v":""},{"$f":"IF(Q35=\"\",\"\",Q35)","v":""},{"$f":"IF(R35=\"\",\"\",R35)","v":""},{"$f":"IF(S35=\"\",\"\",S35)","v":""},{"$f":"IF(T35=\"\",\"\",T35)","v":""},26,null,null,null,null,null,null,"/","","","","","","","","","","","","","","","","","","",""]
[3,null,null,null,null,null,null,null,null,null,null,null,null,null,null,null,null,null,null,null,4,"Citerne 3",null,{"$f":"IFERROR(VLOOKUP($C36,Blad3!$E$11:$E$25,1,FALSE),IF($C36<>\"\",\"ANDERE\",\"\"))","v":""},{"$f":"IF(ISERROR(VLOOKUP($C36,Blad3!$E$11:$E$25,1,FALSE)),IF($C36<>\"\",$C36,\"\"),\"\")","v":""},3,"Citerne 3","","","","","","","","","","","","","","","","","","","",27,null,null,null,null,null,null,"/","","","","","","","","","","","","","","","","","","",""]
[4,null,null,null,null,null,null,null,null,null,null,null,null,null,null,null,null,null,null,null,5,"Citerne 4",null,{"$f":"IFERROR(VLOOKUP($C37,Blad3!$E$11:$E$25,1,FALSE),IF($C37<>\"\",\"ANDERE\",\"\"))","v":""},{"$f":"IF(ISERROR(VLOOKUP($C37,Blad3!$E$11:$E$25,1,FALSE)),IF($C37<>\"\",$C37,\"\"),\"\")","v":""},3,"Citerne 4","","","","","","","","","","","","","","","","","","","",28,null,null,null,null,null,null,"/","","","","","","","","","","","","","","","","","","",""]
[5,null,null,null,null,null,null,null,null,null,null,null,null,null,null,null,null,null,null,null,6,"Citerne 5",null,{"$f":"IFERROR(VLOOKUP($C38,Blad3!$E$11:$E$25,1,FALSE),IF($C38<>\"\",\"ANDERE\",\"\"))","v":""},{"$f":"IF(ISERROR(VLOOKUP($C38,Blad3!$E$11:$E$25,1,FALSE)),IF($C38<>\"\",$C38,\"\"),\"\")","v":""},3,"Citerne 5","","","","","","","","","","","","","","","","","","","",29,null,null,null,null,null,null,"/","","","","","","","","","","","","","","","","","","",""]
[6,null,null,null,null,null,null,null,null,null,null,null,null,null,null,null,null,null,null,null,7,"Citerne 6",null,{"$f":"IFERROR(VLOOKUP($C39,Blad3!$E$11:$E$25,1,FALSE),IF($C39<>\"\",\"ANDERE\",\"\"))","v":""},{"$f":"IF(ISERROR(VLOOKUP($C39,Blad3!$E$11:$E$25,1,FALSE)),IF($C39<>\"\",$C39,\"\"),\"\")","v":""},3,"Citerne 6","","","","","","","","","","","","","","","","","","","",30,null,null,null,null,null,null,"/","","","","","","","","","","","","","","","","","","",""]
[7,null,null,null,null,null,null,null,null,null,null,null,null,null,null,null,null,null,null,null,8,"Citerne 7",null,{"$f":"IFERROR(VLOOKUP($C40,Blad3!$E$11:$E$25,1,FALSE),IF($C40<>\"\",\"ANDERE\",\"\"))","v":""},{"$f":"IF(ISERROR(VLOOKUP($C40,Blad3!$E$11:$E$25,1,FALSE)),IF($C40<>\"\",$C40,\"\"),\"\")","v":""},3,"Citerne 7","","","","","","","","","","","","","","","","","","","",31,null,null,null,null,null,null,"/","","","","","","","","","","","","","","","","","","",""]
[8,null,null,null,null,null,null,null,null,null,null,null,null,null,null,null,null,null,null,null,9,"Citerne 8",null,{"$f":"IFERROR(VLOOKUP($C41,Blad3!$E$11:$E$25,1,FALSE),IF($C41<>\"\",\"ANDERE\",\"\"))","v":""},{"$f":"IF(ISERROR(VLOOKUP($C41,Blad3!$E$11:$E$25,1,FALSE)),IF($C41<>\"\",$C41,\"\"),\"\")","v":""},3,"Citerne 8","","","","","","","","","","","","","","","","","","","",32,null,null,null,null,null,null,"/","","","","","","","","","","","","","","","","","","",""]
[9,null,null,null,null,null,null,null,null,null,null,null,null,null,null,null,null,null,null,null,10,"Citerne 9",null,{"$f":"IFERROR(VLOOKUP($C42,Blad3!$E$11:$E$25,1,FALSE),IF($C42<>\"\",\"ANDERE\",\"\"))","v":""},{"$f":"IF(ISERROR(VLOOKUP($C42,Blad3!$E$11:$E$25,1,FALSE)),IF($C42<>\"\",$C42,\"\"),\"\")","v":""},3,"Citerne 9","","","","","","","","","","","","","","","","","","","",33,null,null,null,null,null,null,"/",{"$f":"IFERROR(VLOOKUP($AU42,$Z$10:$AT$203,AB$9,FALSE),\"\")","v":""},{"$f":"IFERROR(VLOOKUP($AU42,$Z$10:$AT$203,AC$9,FALSE),\"\")","v":""},{"$f":"IFERROR(VLOOKUP($AU42,$Z$10:$AT$203,AD$9,FALSE),\"\")","v":""},{"$f":"IFERROR(VLOOKUP($AU42,$Z$10:$AT$203,AE$9,FALSE),\"\")","v":""},{"$f":"IFERROR(VLOOKUP($AU42,$Z$10:$AT$203,AF$9,FALSE),\"\")","v":""},{"$f":"IFERROR(VLOOKUP($AU42,$Z$10:$AT$203,AG$9,FALSE),\"\")","v":""},{"$f":"IFERROR(VLOOKUP($AU42,$Z$10:$AT$203,AH$9,FALSE),\"\")","v":""},{"$f":"IFERROR(VLOOKUP($AU42,$Z$10:$AT$203,AI$9,FALSE),\"\")","v":""},{"$f":"IFERROR(VLOOKUP($AU42,$Z$10:$AT$203,AJ$9,FALSE),\"\")","v":""},{"$f":"IFERROR(VLOOKUP($AU42,$Z$10:$AT$203,AK$9,FALSE),\"\")","v":""},{"$f":"IFERROR(VLOOKUP($AU42,$Z$10:$AT$203,AL$9,FALSE),\"\")","v":""},{"$f":"IFERROR(VLOOKUP($AU42,$Z$10:$AT$203,AM$9,FALSE),\"\")","v":""},{"$f":"IFERROR(VLOOKUP($AU42,$Z$10:$AT$203,AN$9,FALSE),\"\")","v":""},{"$f":"IFERROR(VLOOKUP($AU42,$Z$10:$AT$203,AO$9,FALSE),\"\")","v":""},{"$f":"IFERROR(VLOOKUP($AU42,$Z$10:$AT$203,AP$9,FALSE),\"\")","v":""},{"$f":"IFERROR(VLOOKUP($AU42,$Z$10:$AT$203,AQ$9,FALSE),\"\")","v":""},{"$f":"IFERROR(VLOOKUP($AU42,$Z$10:$AT$203,AR$9,FALSE),\"\")","v":""},{"$f":"IFERROR(VLOOKUP($AU42,$Z$10:$AT$203,AS$9,FALSE),\"\")","v":""},""]
[10,null,null,null,null,null,null,null,null,null,null,null,null,null,null,null,null,null,null,null,11,"Citerne 10",null,{"$f":"IFERROR(VLOOKUP($C43,Blad3!$E$11:$E$25,1,FALSE),IF($C43<>\"\",\"ANDERE\",\"\"))","v":""},{"$f":"IF(ISERROR(VLOOKUP($C43,Blad3!$E$11:$E$25,1,FALSE)),IF($C43<>\"\",$C43,\"\"),\"\")","v":""},3,"Citerne 10","","","","","","","","","","","","","","","","","","","",34,null,null,null,null,null,null,"/","","","","","","","","","","","","","","","","","","",""]
[11,null,null,null,null,null,null,null,null,null,null,null,null,null,null,null,null,null,null,null,12,"Citerne 11",null,{"$f":"IFERROR(VLOOKUP($C44,Blad3!$E$11:$E$25,1,FALSE),IF($C44<>\"\",\"ANDERE\",\"\"))","v":""},{"$f":"IF(ISERROR(VLOOKUP($C44,Blad3!$E$11:$E$25,1,FALSE)),IF($C44<>\"\",$C44,\"\"),\"\")","v":""},3,"Citerne 11","","","","","","","","","","","","","","","","","","","",35,null,null,null,null,null,null,"/","","","","","","","","","","","","","","","","","","",""]
[12,null,null,null,null,null,null,null,null,null,null,null,null,null,null,null,null,null,null,null,13,"Citerne 12",null,{"$f":"IFERROR(VLOOKUP($C45,Blad3!$E$11:$E$25,1,FALSE),IF($C45<>\"\",\"ANDERE\",\"\"))","v":""},{"$f":"IF(ISERROR(VLOOKUP($C45,Blad3!$E$11:$E$25,1,FALSE)),IF($C45<>\"\",$C45,\"\"),\"\")","v":""},3,"Citerne 12","","","","","","","","","","","","","","","","","","","",36,null,null,null,null,null,null,"/","","","","","","","","","","","","","","","","","","",""]
[13,null,null,null,null,null,null,null,null,null,null,null,null,null,null,null,null,null,null,null,14,"Citerne 13",null,{"$f":"IFERROR(VLOOKUP($C46,Blad3!$E$11:$E$25,1,FALSE),IF($C46<>\"\",\"ANDERE\",\"\"))","v":""},{"$f":"IF(ISERROR(VLOOKUP($C46,Blad3!$E$11:$E$25,1,FALSE)),IF($C46<>\"\",$C46,\"\"),\"\")","v":""},3,{"$f":"IF(V46=\"\",\"\",V46)","v":"Citerne 13"},{"$f":"IF(B46=\"\",\"\",B46)","v":""},"","","","","","","","","","","","","","","","","","",37,null,null,null,null,null,null,"/","","","","","","","","","","","","","","","","","","",""]
[14,null,null,null,null,null,null,null,null,null,null,null,null,null,null,null,null,null,null,null,15,"Citerne 14",null,{"$f":"IFERROR(VLOOKUP($C47,Blad3!$E$11:$E$25,1,FALSE),IF($C47<>\"\",\"ANDERE\",\"\"))","v":""},{"$f":"IF(ISERROR(VLOOKUP($C47,Blad3!$E$11:$E$25,1,FALSE)),IF($C47<>\"\",$C47,\"\"),\"\")","v":""},3,"Citerne 14","","","","","","","","","","","","","","","","","","","",38,null,null,null,null,null,null,"/","","","","","","","","","","","","","","","","","","",""]
[15,null,null,null,null,null,null,null,null,null,null,null,null,null,null,null,null,null,null,null,16,"Citerne 15",null,{"$f":"IFERROR(VLOOKUP($C48,Blad3!$E$11:$E$25,1,FALSE),IF($C48<>\"\",\"ANDERE\",\"\"))","v":""},{"$f":"IF(ISERROR(VLOOKUP($C48,Blad3!$E$11:$E$25,1,FALSE)),IF($C48<>\"\",$C48,\"\"),\"\")","v":""},3,"Citerne 15","","","","","","","","","","","","","","","","","","","",39,null,null,null,null,null,null,"/","","","","","","","","","","","","","","","","","","",""]
[16,null,null,null,null,null,null,null,null,null,null,null,null,null,null,null,null,null,null,null,17,"Citerne 16",null,{"$f":"IFERROR(VLOOKUP($C49,Blad3!$E$11:$E$25,1,FALSE),IF($C49<>\"\",\"ANDERE\",\"\"))","v":""},{"$f":"IF(ISERROR(VLOOKUP($C49,Blad3!$E$11:$E$25,1,FALSE)),IF($C49<>\"\",$C49,\"\"),\"\")","v":""},3,"Citerne 16","","","","","","","","","","","","","","","","","","","",40,null,null,null,null,null,null,"/","","","","","","","","","","","","","","","","","","",""]
[17,null,null,null,null,null,null,null,null,null,null,null,null,null,null,null,null,null,null,null,18,"Citerne 17",null,{"$f":"IFERROR(VLOOKUP($C50,Blad3!$E$11:$E$25,1,FALSE),IF($C50<>\"\",\"ANDERE\",\"\"))","v":""},{"$f":"IF(ISERROR(VLOOKUP($C50,Blad3!$E$11:$E$25,1,FALSE)),IF($C50<>\"\",$C50,\"\"),\"\")","v":""},3,"Citerne 17","","","","","","","","","","","","","","","","","","","",41,null,null,null,null,null,null,"/","","","","","","","","","","","","","","","","","","",""]
[18,null,null,null,null,null,null,null,null,null,null,null,null,null,null,null,null,null,null,null,19,"Citerne 18",null,{"$f":"IFERROR(VLOOKUP($C51,Blad3!$E$11:$E$25,1,FALSE),IF($C51<>\"\",\"ANDERE\",\"\"))","v":""},{"$f":"IF(ISERROR(VLOOKUP($C51,Blad3!$E$11:$E$25,1,FALSE)),IF($C51<>\"\",$C51,\"\"),\"\")","v":""},3,"Citerne 18","","","","","","","","","","","","","","","","","","","",42,null,null,null,null,null,null,"/","","","","","","","","","","","","","","","","","","",""]
[19,null,null,null,null,null,null,null,null,null,null,null,null,null,null,null,null,null,null,null,20,"Citerne 19",null,{"$f":"IFERROR(VLOOKUP($C52,Blad3!$E$11:$E$25,1,FALSE),IF($C52<>\"\",\"ANDERE\",\"\"))","v":""},{"$f":"IF(ISERROR(VLOOKUP($C52,Blad3!$E$11:$E$25,1,FALSE)),IF($C52<>\"\",$C52,\"\"),\"\")","v":""},3,"Citerne 19","","","","","","","","","","","","","","","","","","","",43,null,null,null,null,null,null,"/","","","","","","","","","","","","","","","","","","",""]
[20,null,null,null,null,null,null,null,null,null,null,null,null,null,null,null,null,null,null,null,1,"Citerne 20",null,{"$f":"IFERROR(VLOOKUP($C53,Blad3!$E$11:$E$25,1,FALSE),IF($C53<>\"\",\"ANDERE\",\"\"))","v":""},{"$f":"IF(ISERROR(VLOOKUP($C53,Blad3!$E$11:$E$25,1,FALSE)),IF($C53<>\"\",$C53,\"\"),\"\")","v":""},3,"Citerne 20","","","","","","","","","","","","","","","","","","","",44,null,null,null,null,null,null,"/","","","","","","","","","","","","","","","","","","",""]
[1,null,null,null,null,null,null,null,null,null,null,null,null,null,null,null,null,null,null,null,2,"V-put 1",null,{"$f":"IFERROR(VLOOKUP($C54,Blad3!$E$11:$E$25,1,FALSE),IF($C54<>\"\",\"ANDERE\",\"\"))","v":""},{"$f":"IF(ISERROR(VLOOKUP($C54,Blad3!$E$11:$E$25,1,FALSE)),IF($C54<>\"\",$C54,\"\"),\"\")","v":""},3,"V-put 1","","","","","","","","","","","","","","","","","","","",45,null,null,null,null,null,null,"/","","","","","","","","","","","","","","","","","","",""]
[2,null,null,null,null,null,null,null,null,null,null,null,null,null,null,null,null,null,null,null,3,"V-put 2",null,{"$f":"IFERROR(VLOOKUP($C55,Blad3!$E$11:$E$25,1,FALSE),IF($C55<>\"\",\"ANDERE\",\"\"))","v":""},{"$f":"IF(ISERROR(VLOOKUP($C55,Blad3!$E$11:$E$25,1,FALSE)),IF($C55<>\"\",$C55,\"\"),\"\")","v":""},3,"V-put 2","","","","","","","","","","","","","","","","","","","",46,null,null,null,null,null,null,"/","","","","","","","","","","","","","","","","","","",""]
[3,null,null,null,null,null,null,null,null,null,null,null,null,null,null,null,null,null,null,null,4,"V-put 3",null,{"$f":"IFERROR(VLOOKUP($C56,Blad3!$E$11:$E$25,1,FALSE),IF($C56<>\"\",\"ANDERE\",\"\"))","v":""},{"$f":"IF(ISERROR(VLOOKUP($C56,Blad3!$E$11:$E$25,1,FALSE)),IF($C56<>\"\",$C56,\"\"),\"\")","v":""},3,"V-put 3","","","","","","","","","","","","","","","","","","","",47,null,null,null,null,null,null,"/","","","","","","","","","","","","","","","","","","",""]
[4,null,null,null,null,null,null,null,null,null,null,null,null,null,null,null,null,null,null,null,5,"V-put 4",null,{"$f":"IFERROR(VLOOKUP($C57,Blad3!$E$11:$E$25,1,FALSE),IF($C57<>\"\",\"ANDERE\",\"\"))","v":""},{"$f":"IF(ISERROR(VLOOKUP($C57,Blad3!$E$11:$E$25,1,FALSE)),IF($C57<>\"\",$C57,\"\"),\"\")","v":""},3,"V-put 4","","","","","","","","","","","","","","","","","","","",48,null,null,null,null,null,null,"/","","","","","","","","","","","","","","","","","","",""]
[5,null,null,null,null,null,null,null,null,null,null,null,null,null,null,null,null,null,null,null,6,"V-put 5",null,{"$f":"IFERROR(VLOOKUP($C58,Blad3!$E$11:$E$25,1,FALSE),IF($C58<>\"\",\"ANDERE\",\"\"))","v":""},{"$f":"IF(ISERROR(VLOOKUP($C58,Blad3!$E$11:$E$25,1,FALSE)),IF($C58<>\"\",$C58,\"\"),\"\")","v":""},3,"V-put 5","","","","","","","","","","","","","","","","","","","",49,null,null,null,null,null,null,"/","","","","","","","","","","","","","","","","","","",""]
[6,null,null,null,null,null,null,null,null,null,null,null,null,null,null,null,null,null,null,null,7,"V-put 6",null,{"$f":"IFERROR(VLOOKUP($C59,Blad3!$E$11:$E$25,1,FALSE),IF($C59<>\"\",\"ANDERE\",\"\"))","v":""},{"$f":"IF(ISERROR(VLOOKUP($C59,Blad3!$E$11:$E$25,1,FALSE)),IF($C59<>\"\",$C59,\"\"),\"\")","v":""},3,"V-put 6","","","","","","","","","","","","","","","","","","","",50,null,null,null,null,null,null,"/","","","","","","","","","","","","","","","","","","",""]
[7,null,null,null,null,null,null,null,null,null,null,null,null,null,null,null,null,null,null,null,8,"V-put 7",null,{"$f":"IFERROR(VLOOKUP($C60,Blad3!$E$11:$E$25,1,FALSE),IF($C60<>\"\",\"ANDERE\",\"\"))","v":""},{"$f":"IF(ISERROR(VLOOKUP($C60,Blad3!$E$11:$E$25,1,FALSE)),IF($C60<>\"\",$C60,\"\"),\"\")","v":""},3,"V-put 7","","","","","","","","","","","","","","","","","","","",51,null,null,null,null,null,null,"/","","","","","","","","","","","","","","","","","","",""]
[8,null,null,null,null,null,null,null,null,null,null,null,null,null,null,null,null,null,null,null,9,"V-put 8",null,{"$f":"IFERROR(VLOOKUP($C61,Blad3!$E$11:$E$25,1,FALSE),IF($C61<>\"\",\"ANDERE\",\"\"))","v":""},{"$f":"IF(ISERROR(VLOOKUP($C61,Blad3!$E$11:$E$25,1,FALSE)),IF($C61<>\"\",$C61,\"\"),\"\")","v":""},3,"V-put 8","","","","","","","","","","","","","","","","","","","",52,null,null,null,null,null,null,"/","","","","","","","","","","","","","","","","","","",""]
[9,null,null,null,null,null,null,null,null,null,null,null,null,null,null,null,null,null,null,null,10,"V-put 9",null,{"$f":"IFERROR(VLOOKUP($C62,Blad3!$E$11:$E$25,1,FALSE),IF($C62<>\"\",\"ANDERE\",\"\"))","v":""},{"$f":"IF(ISERROR(VLOOKUP($C62,Blad3!$E$11:$E$25,1,FALSE)),IF($C62<>\"\",$C62,\"\"),\"\")","v":""},3,"V-put 9","","","","","","","","","","","","","","","","","","","",53,null,null,null,null,null,null,"/","","","","","","","","","","","","","","","","","","",""]
[10,null,null,null,null,null,null,null,null,null,null,null,null,null,null,null,null,null,null,null,11,"V-put 10",null,{"$f":"IFERROR(VLOOKUP($C63,Blad3!$E$11:$E$25,1,FALSE),IF($C63<>\"\",\"ANDERE\",\"\"))","v":""},{"$f":"IF(ISERROR(VLOOKUP($C63,Blad3!$E$11:$E$25,1,FALSE)),IF($C63<>\"\",$C63,\"\"),\"\")","v":""},3,"V-put 10","","","","","","","","","","","","","","","","","","","",54,null,null,null,null,null,null,"/","","","","","","","","","","","","","","","","","","",""]
[11,null,null,null,null,null,null,null,null,null,null,null,null,null,null,null,null,null,null,null,12,"V-put 11",null,{"$f":"IFERROR(VLOOKUP($C64,Blad3!$E$11:$E$25,1,FALSE),IF($C64<>\"\",\"ANDERE\",\"\"))","v":""},{"$f":"IF(ISERROR(VLOOKUP($C64,Blad3!$E$11:$E$25,1,FALSE)),IF($C64<>\"\",$C64,\"\"),\"\")","v":""},3,"V-put 11","","","","","","","","","","","","","","","","","","","",55,null,null,null,null,null,null,"/","","","","","","","","","","","","","","","","","","",""]
[12,null,null,null,null,null,null,null,null,null,null,null,null,null,null,null,null,null,null,null,13,"V-put 12",null,{"$f":"IFERROR(VLOOKUP($C65,Blad3!$E$11:$E$25,1,FALSE),IF($C65<>\"\",\"ANDERE\",\"\"))","v":""},{"$f":"IF(ISERROR(VLOOKUP($C65,Blad3!$E$11:$E$25,1,FALSE)),IF($C65<>\"\",$C65,\"\"),\"\")","v":""},3,"V-put 12","","","","","","","","","","","","","","","","","","","",56,null,null,null,null,null,null,"/","","","","","","","","","","","","","","","","","","",""]
[13,null,null,null,null,null,null,null,null,null,null,null,null,null,null,null,null,null,null,null,14,"V-put 13",null,{"$f":"IFERROR(VLOOKUP($C66,Blad3!$E$11:$E$25,1,FALSE),IF($C66<>\"\",\"ANDERE\",\"\"))","v":""},{"$f":"IF(ISERROR(VLOOKUP($C66,Blad3!$E$11:$E$25,1,FALSE)),IF($C66<>\"\",$C66,\"\"),\"\")","v":""},3,"V-put 13","","","","","","","","","","","","","","","","","","","",57,null,null,null,null,null,null,"/","","","","","","","","","","","","","","","","","","",""]
[14,null,null,null,null,null,null,null,null,null,null,null,null,null,null,null,null,null,null,null,15,"V-put 14",null,{"$f":"IFERROR(VLOOKUP($C67,Blad3!$E$11:$E$25,1,FALSE),IF($C67<>\"\",\"ANDERE\",\"\"))","v":""},{"$f":"IF(ISERROR(VLOOKUP($C67,Blad3!$E$11:$E$25,1,FALSE)),IF($C67<>\"\",$C67,\"\"),\"\")","v":""},3,"V-put 14","","","","","","","","","","","","","","","","","","","",58,null,null,null,null,null,null,"/","","","","","","","","","","","","","","","","","","",""]
[15,null,null,null,null,null,null,null,null,null,null,null,null,null,null,null,null,null,null,null,16,"V-put 15",null,{"$f":"IFERROR(VLOOKUP($C68,Blad3!$E$11:$E$25,1,FALSE),IF($C68<>\"\",\"ANDERE\",\"\"))","v":""},{"$f":"IF(ISERROR(VLOOKUP($C68,Blad3!$E$11:$E$25,1,FALSE)),IF($C68<>\"\",$C68,\"\"),\"\")","v":""},3,"V-put 15","","","","","","","","","","","","","","","","","","","",59,null,null,null,null,null,null,"/","","","","","","","","","","","","","","","","","","",""]
[16,null,null,null,null,null,null,null,null,null,null,null,null,null,null,null,null,null,null,null,17,"V-put 16",null,{"$f":"IFERROR(VLOOKUP($C69,Blad3!$E$11:$E$25,1,FALSE),IF($C69<>\"\",\"ANDERE\",\"\"))","v":""},{"$f":"IF(ISERROR(VLOOKUP($C69,Blad3!$E$11:$E$25,1,FALSE)),IF($C69<>\"\",$C69,\"\"),\"\")","v":""},3,"V-put 16","","","","","","","","","","","","","","","","","","","",60,null,null,null,null,null,null,"/","","","","","","","","","","","","","","","","","","",""]
[17,null,null,null,null,null,null,null,null,null,null,null,null,null,null,null,null,null,null,null,18,"V-put 17",null,{"$f":"IFERROR(VLOOKUP($C70,Blad3!$E$11:$E$25,1,FALSE),IF($C70<>\"\",\"ANDERE\",\"\"))","v":""},{"$f":"IF(ISERROR(VLOOKUP($C70,Blad3!$E$11:$E$25,1,FALSE)),IF($C70<>\"\",$C70,\"\"),\"\")","v":""},3,"V-put 17","","","","","","","","","","","","","","","","","","","",61,null,null,null,null,null,null,"/","","","","","","","","","","","","","","","","","","",""]
[18,null,null,null,null,null,null,null,null,null,null,null,null,null,null,null,null,null,null,null,19,"V-put 18",null,{"$f":"IFERROR(VLOOKUP($C71,Blad3!$E$11:$E$25,1,FALSE),IF($C71<>\"\",\"ANDERE\",\"\"))","v":""},{"$f":"IF(ISERROR(VLOOKUP($C71,Blad3!$E$11:$E$25,1,FALSE)),IF($C71<>\"\",$C71,\"\"),\"\")","v":""},3,"V-put 18","","","","","","","","","","","","","","","","","","","",62,null,null,null,null,null,null,"/","","","","","","","","","","","","","","","","","","",""]
[19,null,null,null,null,null,null,null,null,null,null,null,null,null,null,null,null,null,null,null,20,"V-put 19",null,{"$f":"IFERROR(VLOOKUP($C72,Blad3!$E$11:$E$25,1,FALSE),IF($C72<>\"\",\"ANDERE\",\"\"))","v":""},{"$f":"IF(ISERROR(VLOOKUP($C72,Blad3!$E$11:$E$25,1,FALSE)),IF($C72<>\"\",$C72,\"\"),\"\")","v":""},3,"V-put 19","","","","","","","","","","","","","","","","","","","",63,null,null,null,null,null,null,"/","","","","","","","","","","","","","","","","","","",""]
[20,null,null,null,null,null,null,null,null,null,null,null,null,null,null,null,null,null,null,null,1,"V-put 20",null,{"$f":"IFERROR(VLOOKUP($C73,Blad3!$E$11:$E$25,1,FALSE),IF($C73<>\"\",\"ANDERE\",\"\"))","v":""},{"$f":"IF(ISERROR(VLOOKUP($C73,Blad3!$E$11:$E$25,1,FALSE)),IF($C73<>\"\",$C73,\"\"),\"\")","v":""},3,"V-put 20","","","","","","","","","","","","","","","","","","","",64,null,null,null,null,null,null,"/","","","","","","","","","","","","","","","","","","",""]
[1,null,null,null,null,null,null,null,null,null,null,null,null,null,null,null,null,null,null,null,2,"Lagune 1",null,{"$f":"IFERROR(VLOOKUP($C74,Blad3!$E$11:$E$25,1,FALSE),IF($C74<>\"\",\"ANDERE\",\"\"))","v":""},{"$f":"IF(ISERROR(VLOOKUP($C74,Blad3!$E$11:$E$25,1,FALSE)),IF($C74<>\"\",$C74,\"\"),\"\")","v":""},3,"Lagune 1","","","","","","","","","","","","","","","","","","","",65,null,null,null,null,null,null,"/",{"$f":"IFERROR(VLOOKUP($AU74,$Z$10:$AT$203,AB$9,FALSE),\"\")","v":""},{"$f":"IFERROR(VLOOKUP($AU74,$Z$10:$AT$203,AC$9,FALSE),\"\")","v":""},{"$f":"IFERROR(VLOOKUP($AU74,$Z$10:$AT$203,AD$9,FALSE),\"\")","v":""},{"$f":"IFERROR(VLOOKUP($AU74,$Z$10:$AT$203,AE$9,FALSE),\"\")","v":""},{"$f":"IFERROR(VLOOKUP($AU74,$Z$10:$AT$203,AF$9,FALSE),\"\")","v":""},{"$f":"IFERROR(VLOOKUP($AU74,$Z$10:$AT$203,AG$9,FALSE),\"\")","v":""},{"$f":"IFERROR(VLOOKUP($AU74,$Z$10:$AT$203,AH$9,FALSE),\"\")","v":""},{"$f":"IFERROR(VLOOKUP($AU74,$Z$10:$AT$203,AI$9,FALSE),\"\")","v":""},{"$f":"IFERROR(VLOOKUP($AU74,$Z$10:$AT$203,AJ$9,FALSE),\"\")","v":""},{"$f":"IFERROR(VLOOKUP($AU74,$Z$10:$AT$203,AK$9,FALSE),\"\")","v":""},{"$f":"IFERROR(VLOOKUP($AU74,$Z$10:$AT$203,AL$9,FALSE),\"\")","v":""},{"$f":"IFERROR(VLOOKUP($AU74,$Z$10:$AT$203,AM$9,FALSE),\"\")","v":""},{"$f":"IFERROR(VLOOKUP($AU74,$Z$10:$AT$203,AN$9,FALSE),\"\")","v":""},{"$f":"IFERROR(VLOOKUP($AU74,$Z$10:$AT$203,AO$9,FALSE),\"\")","v":""},{"$f":"IFERROR(VLOOKUP($AU74,$Z$10:$AT$203,AP$9,FALSE),\"\")","v":""},{"$f":"IFERROR(VLOOKUP($AU74,$Z$10:$AT$203,AQ$9,FALSE),\"\")","v":""},{"$f":"IFERROR(VLOOKUP($AU74,$Z$10:$AT$203,AR$9,FALSE),\"\")","v":""},{"$f":"IFERROR(VLOOKUP($AU74,$Z$10:$AT$203,AS$9,FALSE),\"\")","v":""},""]
[2,null,null,null,null,null,null,null,null,null,null,null,null,null,null,null,null,null,null,null,3,"Lagune 2",null,{"$f":"IFERROR(VLOOKUP($C75,Blad3!$E$11:$E$25,1,FALSE),IF($C75<>\"\",\"ANDERE\",\"\"))","v":""},{"$f":"IF(ISERROR(VLOOKUP($C75,Blad3!$E$11:$E$25,1,FALSE)),IF($C75<>\"\",$C75,\"\"),\"\")","v":""},3,"Lagune 2","","","","","","","","","","","","","","","","","","","",66,null,null,null,null,null,null,{"$f":"IFERROR(VLOOKUP($AU75,$Z$10:$AT$203,AA$9,FALSE),\"/\")","v":"/"},"","","","","","","","","","","","","","","","","","",""]
[3,null,null,null,null,null,null,null,null,null,null,null,null,null,null,null,null,null,null,null,4,"Lagune 3",null,{"$f":"IFERROR(VLOOKUP($C76,Blad3!$E$11:$E$25,1,FALSE),IF($C76<>\"\",\"ANDERE\",\"\"))","v":""},{"$f":"IF(ISERROR(VLOOKUP($C76,Blad3!$E$11:$E$25,1,FALSE)),IF($C76<>\"\",$C76,\"\"),\"\")","v":""},{"$f":"IF(B76<>\"\",Z75+1,Z75)","v":3},"Lagune 3","","","","","","","","","","","","","","","","","","","",67,null,null,null,null,null,null,"/","","","","","","","","","","","","","","","","","","",""]
[4,null,null,null,null,null,null,null,null,null,null,null,null,null,null,null,null,null,null,null,5,"Lagune 4",null,{"$f":"IFERROR(VLOOKUP($C77,Blad3!$E$11:$E$25,1,FALSE),IF($C77<>\"\",\"ANDERE\",\"\"))","v":""},{"$f":"IF(ISERROR(VLOOKUP($C77,Blad3!$E$11:$E$25,1,FALSE)),IF($C77<>\"\",$C77,\"\"),\"\")","v":""},3,"Lagune 4","","","","","","","","","","","","","","","","","","","",68,null,null,null,null,null,null,"/","","","","","","","","","","","","","","","","","","",""]
[5,null,null,null,null,null,null,null,null,null,null,null,null,null,null,null,null,null,null,null,6,"Lagune 5",null,{"$f":"IFERROR(VLOOKUP($C78,Blad3!$E$11:$E$25,1,FALSE),IF($C78<>\"\",\"ANDERE\",\"\"))","v":""},{"$f":"IF(ISERROR(VLOOKUP($C78,Blad3!$E$11:$E$25,1,FALSE)),IF($C78<>\"\",$C78,\"\"),\"\")","v":""},3,{"$f":"IF(V78=\"\",\"\",V78)","v":"Lagune 5"},{"$f":"IF(B78=\"\",\"\",B78)","v":""},"","","","","","","","","","","","","","","","","","",69,null,null,null,null,null,null,"/","","","","","","","","","","","","","","","","","","",""]
[6,null,null,null,null,null,null,null,null,null,null,null,null,null,null,null,null,null,null,null,7,"Lagune 6",null,{"$f":"IFERROR(VLOOKUP($C79,Blad3!$E$11:$E$25,1,FALSE),IF($C79<>\"\",\"ANDERE\",\"\"))","v":""},{"$f":"IF(ISERROR(VLOOKUP($C79,Blad3!$E$11:$E$25,1,FALSE)),IF($C79<>\"\",$C79,\"\"),\"\")","v":""},3,"Lagune 6","","","","","","","","","","","","","","","","","","","",70,null,null,null,null,null,null,"/","","","","","","","","","","","","","","","","","","",""]
[7,null,null,null,null,null,null,null,null,null,null,null,null,null,null,null,null,null,null,null,8,"Lagune 7",null,{"$f":"IFERROR(VLOOKUP($C80,Blad3!$E$11:$E$25,1,FALSE),IF($C80<>\"\",\"ANDERE\",\"\"))","v":""},{"$f":"IF(ISERROR(VLOOKUP($C80,Blad3!$E$11:$E$25,1,FALSE)),IF($C80<>\"\",$C80,\"\"),\"\")","v":""},3,"Lagune 7","","","","","","","","","","","","","","","","","","","",71,null,null,null,null,null,null,"/","","","","","","","","","","","","","","","","","","",""]
[8,null,null,null,null,null,null,null,null,null,null,null,null,null,null,null,null,null,null,null,9,"Lagune 8",null,{"$f":"IFERROR(VLOOKUP($C81,Blad3!$E$11:$E$25,1,FALSE),IF($C81<>\"\",\"ANDERE\",\"\"))","v":""},{"$f":"IF(ISERROR(VLOOKUP($C81,Blad3!$E$11:$E$25,1,FALSE)),IF($C81<>\"\",$C81,\"\"),\"\")","v":""},3,"Lagune 8","","","","","","","","","","","","","","","","","","","",72,null,null,null,null,null,null,"/","","","","","","","","","","","","","","","","","","",""]
[9,null,null,null,null,null,null,null,null,null,null,null,null,null,null,null,null,null,null,null,10,"Lagune 9",null,{"$f":"IFERROR(VLOOKUP($C82,Blad3!$E$11:$E$25,1,FALSE),IF($C82<>\"\",\"ANDERE\",\"\"))","v":""},{"$f":"IF(ISERROR(VLOOKUP($C82,Blad3!$E$11:$E$25,1,FALSE)),IF($C82<>\"\",$C82,\"\"),\"\")","v":""},3,"Lagune 9","","","","","","","","","","","","","","","","","","","",73,null,null,null,null,null,null,"/","","","","","","","","","","","","","","","","","","",""]
[10,null,null,null,null,null,null,null,null,null,null,null,null,null,null,null,null,null,null,null,11,"Lagune 10",null,{"$f":"IFERROR(VLOOKUP($C83,Blad3!$E$11:$E$25,1,FALSE),IF($C83<>\"\",\"ANDERE\",\"\"))","v":""},{"$f":"IF(ISERROR(VLOOKUP($C83,Blad3!$E$11:$E$25,1,FALSE)),IF($C83<>\"\",$C83,\"\"),\"\")","v":""},3,"Lagune 10","","","","","","","","","","","","","","","","","","","",74,null,null,null,null,null,null,"/","","","","","","","","","","","","","","","","","","",""]
[11,null,null,null,null,null,null,null,null,null,null,null,null,null,null,null,null,null,null,null,12,"Lagune 11",null,{"$f":"IFERROR(VLOOKUP($C84,Blad3!$E$11:$E$25,1,FALSE),IF($C84<>\"\",\"ANDERE\",\"\"))","v":""},{"$f":"IF(ISERROR(VLOOKUP($C84,Blad3!$E$11:$E$25,1,FALSE)),IF($C84<>\"\",$C84,\"\"),\"\")","v":""},3,"Lagune 11","","","","","","","","","","","","","","","","","","","",75,null,null,null,null,null,null,"/","","","","","","","","","","","","","","","","","","",""]
[12,null,null,null,null,null,null,null,null,null,null,null,null,null,null,null,null,null,null,null,13,"Lagune 12",null,{"$f":"IFERROR(VLOOKUP($C85,Blad3!$E$11:$E$25,1,FALSE),IF($C85<>\"\",\"ANDERE\",\"\"))","v":""},{"$f":"IF(ISERROR(VLOOKUP($C85,Blad3!$E$11:$E$25,1,FALSE)),IF($C85<>\"\",$C85,\"\"),\"\")","v":""},3,"Lagune 12","","","","","","","","","","","","","","","","","","","",76,null,null,null,null,null,null,"/","","","","","","","","","","","","","","","","","","",""]
[13,null,null,null,null,null,null,null,null,null,null,null,null,null,null,null,null,null,null,null,14,"Lagune 13",null,{"$f":"IFERROR(VLOOKUP($C86,Blad3!$E$11:$E$25,1,FALSE),IF($C86<>\"\",\"ANDERE\",\"\"))","v":""},{"$f":"IF(ISERROR(VLOOKUP($C86,Blad3!$E$11:$E$25,1,FALSE)),IF($C86<>\"\",$C86,\"\"),\"\")","v":""},3,"Lagune 13","","","","","","","","","","","","","","","","","","","",77,null,null,null,null,null,null,"/","","","","","","","","","","","","","","","","","","",""]
[14,null,null,null,null,null,null,null,null,null,null,null,null,null,null,null,null,null,null,null,15,"Lagune 14",null,{"$f":"IFERROR(VLOOKUP($C87,Blad3!$E$11:$E$25,1,FALSE),IF($C87<>\"\",\"ANDERE\",\"\"))","v":""},{"$f":"IF(ISERROR(VLOOKUP($C87,Blad3!$E$11:$E$25,1,FALSE)),IF($C87<>\"\",$C87,\"\"),\"\")","v":""},3,"Lagune 14","","","","","","","","","","","","","","","","","","","",78,null,null,null,null,null,null,"/","","","","","","","","","","","","","","","","","","",""]
[15,null,null,null,null,null,null,null,null,null,null,null,null,null,null,null,null,null,null,null,16,"Lagune 15",null,{"$f":"IFERROR(VLOOKUP($C88,Blad3!$E$11:$E$25,1,FALSE),IF($C88<>\"\",\"ANDERE\",\"\"))","v":""},{"$f":"IF(ISERROR(VLOOKUP($C88,Blad3!$E$11:$E$25,1,FALSE)),IF($C88<>\"\",$C88,\"\"),\"\")","v":""},3,"Lagune 15","","","","","","","","","","","","","","","","","","","",79,null,null,null,null,null,null,"/","","","","","","","","","","","","","","","","","","",""]
[16,null,null,null,null,null,null,null,null,null,null,null,null,null,null,null,null,null,null,null,17,"Lagune 16",null,{"$f":"IFERROR(VLOOKUP($C89,Blad3!$E$11:$E$25,1,FALSE),IF($C89<>\"\",\"ANDERE\",\"\"))","v":""},{"$f":"IF(ISERROR(VLOOKUP($C89,Blad3!$E$11:$E$25,1,FALSE)),IF($C89<>\"\",$C89,\"\"),\"\")","v":""},3,"Lagune 16","","","","","","","","","","","","","","","","","","","",80,null,null,null,null,null,null,"/","","","","","","","","","","","","","","","","","","",""]
[17,null,null,null,null,null,null,null,null,null,null,null,null,null,null,null,null,null,null,null,18,"Lagune 17",null,{"$f":"IFERROR(VLOOKUP($C90,Blad3!$E$11:$E$25,1,FALSE),IF($C90<>\"\",\"ANDERE\",\"\"))","v":""},{"$f":"IF(ISERROR(VLOOKUP($C90,Blad3!$E$11:$E$25,1,FALSE)),IF($C90<>\"\",$C90,\"\"),\"\")","v":""},3,"Lagune 17","","","","","","","","","","","","","","","","","","","",81,null,null,null,null,null,null,"/","","","","","","","","","","","","","","","","","","",""]
[18,null,null,null,null,null,null,null,null,null,null,null,null,null,null,null,null,null,null,null,19,"Lagune 18",null,{"$f":"IFERROR(VLOOKUP($C91,Blad3!$E$11:$E$25,1,FALSE),IF($C91<>\"\",\"ANDERE\",\"\"))","v":""},{"$f":"IF(ISERROR(VLOOKUP($C91,Blad3!$E$11:$E$25,1,FALSE)),IF($C91<>\"\",$C91,\"\"),\"\")","v":""},3,"Lagune 18","","","","","","","","","","","","","","","","","","","",82,null,null,null,null,null,null,"/","","","","","","","","","","","","","","","","","","",""]
[19,null,null,null,null,null,null,null,null,null,null,null,null,null,null,null,null,null,null,null,20,"Lagune 19",null,{"$f":"IFERROR(VLOOKUP($C92,Blad3!$E$11:$E$25,1,FALSE),IF($C92<>\"\",\"ANDERE\",\"\"))","v":""},{"$f":"IF(ISERROR(VLOOKUP($C92,Blad3!$E$11:$E$25,1,FALSE)),IF($C92<>\"\",$C92,\"\"),\"\")","v":""},3,"Lagune 19","","","","","","","","","","","","","","","","","","","",83,null,null,null,null,null,null,"/","","","","","","","","","","","","","","","","","","",""]
[20,null,null,null,null,null,null,null,null,null,null,null,null,null,null,null,null,null,null,null,1,"Lagune 20",null,{"$f":"IFERROR(VLOOKUP($C93,Blad3!$E$11:$E$25,1,FALSE),IF($C93<>\"\",\"ANDERE\",\"\"))","v":""},{"$f":"IF(ISERROR(VLOOKUP($C93,Blad3!$E$11:$E$25,1,FALSE)),IF($C93<>\"\",$C93,\"\"),\"\")","v":""},3,"Lagune 20","","","","","","","","","","","","","","","","","","","",84,null,null,null,null,null,null,"/","","","","","","","","","","","","","","","","","","",""]
[null,null,null,null,null,null,null,null,null,null,null,null,null,null,null,null,{"$f":"SUM(Q14:Q93)","v":0},{"$f":"SUM(R14:R93)","v":0},{"$f":"SUM(S14:S93)","v":0},{"$f":"SUM(T14:T93)","v":0},null,null,null,null,null,3,{"$f":"IF(A94=\"\",\"\",A94)","v":""},"","","","","","","","","","","","","","","",0,0,0,0,85,null,null,null,null,null,null,"/","","","","","","","","","","","","","","","","","","",""]
[null,null,null,null,null,null,null,null,null,null,null,null,null,null,null,null,null,null,null,null,null,null,null,null,null,3,"","","","","","","","","","","","","","","","","","","","",86,null,null,null,null,null,null,"/","","","","","","","","","","","","","","","","","","",""]
[null,null,null,null,null,null,null,null,null,null,null,null,null,null,null,null,null,null,null,null,null,null,null,null,null,3,"","","","","","","","","","","","","","","","","","","","",87,null,null,null,null,null,null,"/","","","","","","","","","","","","","","","","","","",""]
[null,null,null,null,null,null,null,null,null,null,null,null,null,null,null,null,null,null,null,null,null,null,null,null,null,3,"","","","","","","","","","","","","","","","","","","","",88,null,null,null,null,null,null,"/","","","","","","","","","","","","","","","","","","",""]
[null,null,null,null,null,null,null,null,null,null,null,null,null,null,null,null,null,null,null,null,null,null,null,null,null,3,"","","","","","","","","","","","","","","","","","","","",89,null,null,null,null,null,null,"/","","","","","","","","","","","","","","","","","","",""]
[null,null,null,null,null,null,null,null,null,null,null,null,null,null,null,null,null,null,null,null,null,null,null,null,null,3,"","",{"$f":"IF(C99=\"\",\"\",C99)","v":""},{"$f":"IF(D99=\"\",\"\",D99)","v":""},{"$f":"IF(E99=\"\",\"\",E99)","v":""},{"$f":"IF(F99=\"\",\"\",F99)","v":""},{"$f":"IF(G99=\"\",\"\",G99)","v":""},{"$f":"IF(H99=\"\",\"\",H99)","v":""},{"$f":"IF(I99=\"\",\"\",I99)","v":""},{"$f":"IF(J99=\"\",\"\",J99)","v":""},{"$f":"IF(K99=\"\",\"\",K99)","v":""},{"$f":"IF(L99=\"\",\"\",L99)","v":""},{"$f":"IF(M99=\"\",\"\",M99)","v":""},{"$f":"IF(N99=\"\",\"\",N99)","v":""},{"$f":"IF(O99=\"\",\"\",O99)","v":""},{"$f":"IF(P99=\"\",\"\",P99)","v":""},{"$f":"IF(Q99=\"\",\"\",Q99)","v":""},{"$f":"IF(R99=\"\",\"\",R99)","v":""},{"$f":"IF(S99=\"\",\"\",S99)","v":""},{"$f":"IF(T99=\"\",\"\",T99)","v":""},90,null,null,null,null,null,null,"/","","","","","","","","","","","","","","","","","","",""]
["Overzicht vaste mestopslag",null,null,null,null,null,null,null,null,null,null,null,null,null,null,null,null,null,null,null,null,null,null,null,null,{"$f":"IF(A100<>\"\",Z99+1,Z99)","v":4},"Overzicht vaste mestopslag","","","","","","","","","","","","","","","","","","","",91,null,null,null,null,null,null,"/","","","","","","","","","","","","","","","","","","",""]
[null,null,null,null,null,null,null,null,null,null,null,null,null,null,null,null,null,null,null,null,null,null,null,null,null,{"$f":"IF(A101<>\"\",Z100+1,Z100)","v":4},"","","","","","","","","","","","","","","","","","","","",92,null,null,null,null,null,null,"/","","","","","","","","","","","","","","","","","","",""]
["ingegeven opslagen",null,null,null,null,null,null,null,null,"b2 =",null,"L =","L1 =","L2 =",null,null,null,null,null,null,null,null,null,null,null,{"$f":"IF(A102<>\"\",Z101+1,Z101)","v":5},"ingegeven opslagen","","","","","","","","",{"$f":"IF(#REF!=\"\",\"\",#REF!)","v":{"$error":"#REF!"}},"","L =","L1 =","L2 =",{"$f":"IF(#REF!=\"\",\"\",#REF!)","v":{"$error":"#REF!"}},{"$f":"IF(P103=\"\",\"\",P103)","v":"r ="},"","","","",93,null,null,null,null,null,null,"/","","","","","","","","","","","","","","","","","","",""]
["volgnummer","Naam opslag","mestsoort","a =","a1 =","b =","b1 =","h =","h1 =","c =","c1 =","d =","d1 =","d2 =","R =","r =","Capaciteit","inhoud","inhoud N","inhoud P2O5",null,null,null,null,null,{"$f":"IF(A103<>\"\",Z102+1,Z102)","v":6},"volgnummer","Naam opslag","mestsoort","a =","a1 =","b =","b1 =","h =","h1 =","c =","c1 =","d =","d1 =","d2 =",{"$f":"IF(O103=\"\",\"\",O103)","v":"R ="},{"$f":"IF(#REF!=\"\",\"\",#REF!)","v":{"$error":"#REF!"}},"Capaciteit","inhoud","inhoud N","inhoud P2O5",94,null,null,null,null,null,null,"/","","","","","","","","","","","","","","","","","","",""]
[1,null,null,null,null,null,null,null,null,null,null,null,null,null,null,null,null,null,null,null,2,"Recht 1",null,{"$f":"IFERROR(VLOOKUP($C104,Blad3!$F$31:$F$61,1,FALSE),IF($C104<>\"\",\"ANDERE\",\"\"))","v":""},{"$f":"IF(ISERROR(VLOOKUP($C104,Blad3!$F$31:$F$61,1,FALSE)),IF($C104<>\"\",$C104,\"\"),\"\")","v":""},6,{"$f":"IF(V104=\"\",\"\",V104)","v":"Recht 1"},"","","","","","","","","","","","","","","","","","","",95,null,null,null,null,null,null,"/","","","","","","","","","","","","","","","","","","",""]
[2,null,null,null,null,null,null,null,null,null,null,null,null,null,null,null,null,null,null,null,3,"Recht 2",null,{"$f":"IFERROR(VLOOKUP($C105,Blad3!$F$31:$F$61,1,FALSE),IF($C105<>\"\",\"ANDERE\",\"\"))","v":""},{"$f":"IF(ISERROR(VLOOKUP($C105,Blad3!$F$31:$F$61,1,FALSE)),IF($C105<>\"\",$C105,\"\"),\"\")","v":""},6,"Recht 2","","","","","","","","","","","","","","","","","","","",96,null,null,null,null,null,null,"/","","","","","","","","","","","","","","","","","","",""]
[3,null,null,null,null,null,null,null,null,null,null,null,null,null,null,null,null,null,null,null,4,"Recht 3",null,{"$f":"IFERROR(VLOOKUP($C106,Blad3!$F$31:$F$61,1,FALSE),IF($C106<>\"\",\"ANDERE\",\"\"))","v":""},{"$f":"IF(ISERROR(VLOOKUP($C106,Blad3!$F$31:$F$61,1,FALSE)),IF($C106<>\"\",$C106,\"\"),\"\")","v":""},6,"Recht 3","","","","","","","","","","","","","","","","","","","",97,null,null,null,null,null,null,"/",{"$f":"IFERROR(VLOOKUP($AU106,$Z$10:$AT$203,AB$9,FALSE),\"\")","v":""},{"$f":"IFERROR(VLOOKUP($AU106,$Z$10:$AT$203,AC$9,FALSE),\"\")","v":""},{"$f":"IFERROR(VLOOKUP($AU106,$Z$10:$AT$203,AD$9,FALSE),\"\")","v":""},{"$f":"IFERROR(VLOOKUP($AU106,$Z$10:$AT$203,AE$9,FALSE),\"\")","v":""},{"$f":"IFERROR(VLOOKUP($AU106,$Z$10:$AT$203,AF$9,FALSE),\"\")","v":""},{"$f":"IFERROR(VLOOKUP($AU106,$Z$10:$AT$203,AG$9,FALSE),\"\")","v":""},{"$f":"IFERROR(VLOOKUP($AU106,$Z$10:$AT$203,AH$9,FALSE),\"\")","v":""},{"$f":"IFERROR(VLOOKUP($AU106,$Z$10:$AT$203,AI$9,FALSE),\"\")","v":""},{"$f":"IFERROR(VLOOKUP($AU106,$Z$10:$AT$203,AJ$9,FALSE),\"\")","v":""},{"$f":"IFERROR(VLOOKUP($AU106,$Z$10:$AT$203,AK$9,FALSE),\"\")","v":""},{"$f":"IFERROR(VLOOKUP($AU106,$Z$10:$AT$203,AL$9,FALSE),\"\")","v":""},{"$f":"IFERROR(VLOOKUP($AU106,$Z$10:$AT$203,AM$9,FALSE),\"\")","v":""},{"$f":"IFERROR(VLOOKUP($AU106,$Z$10:$AT$203,AN$9,FALSE),\"\")","v":""},{"$f":"IFERROR(VLOOKUP($AU106,$Z$10:$AT$203,AO$9,FALSE),\"\")","v":""},{"$f":"IFERROR(VLOOKUP($AU106,$Z$10:$AT$203,AP$9,FALSE),\"\")","v":""},{"$f":"IFERROR(VLOOKUP($AU106,$Z$10:$AT$203,AQ$9,FALSE),\"\")","v":""},{"$f":"IFERROR(VLOOKUP($AU106,$Z$10:$AT$203,AR$9,FALSE),\"\")","v":""},{"$f":"IFERROR(VLOOKUP($AU106,$Z$10:$AT$203,AS$9,FALSE),\"\")","v":""},""]
[4,null,null,null,null,null,null,null,null,null,null,null,null,null,null,null,null,null,null,null,5,"Recht 4",null,{"$f":"IFERROR(VLOOKUP($C107,Blad3!$F$31:$F$61,1,FALSE),IF($C107<>\"\",\"ANDERE\",\"\"))","v":""},{"$f":"IF(ISERROR(VLOOKUP($C107,Blad3!$F$31:$F$61,1,FALSE)),IF($C107<>\"\",$C107,\"\"),\"\")","v":""},6,"Recht 4","","","","","","","","","","","","","","","","","","","",98,null,null,null,null,null,null,"/","","","","","","","","","","","","","","","","","","",""]
[5,null,null,null,null,null,null,null,null,null,null,null,null,null,null,null,null,null,null,null,6,"Recht 5",null,{"$f":"IFERROR(VLOOKUP($C108,Blad3!$F$31:$F$61,1,FALSE),IF($C108<>\"\",\"ANDERE\",\"\"))","v":""},{"$f":"IF(ISERROR(VLOOKUP($C108,Blad3!$F$31:$F$61,1,FALSE)),IF($C108<>\"\",$C108,\"\"),\"\")","v":""},6,"Recht 5","","","","","","","","","","","","","","","","","","","",99,null,null,null,null,null,null,"/","","","","","","","","","","","","","","","","","","",""]
[6,null,null,null,null,null,null,null,null,null,null,null,null,null,null,null,null,null,null,null,7,"Recht 6",null,{"$f":"IFERROR(VLOOKUP($C109,Blad3!$F$31:$F$61,1,FALSE),IF($C109<>\"\",\"ANDERE\",\"\"))","v":""},{"$f":"IF(ISERROR(VLOOKUP($C109,Blad3!$F$31:$F$61,1,FALSE)),IF($C109<>\"\",$C109,\"\"),\"\")","v":""},6,"Recht 6","","","","","","","","","","","","","","","","","","","",100,null,null,null,null,null,null,"/","","","","","","","","","","","","","","","","","","",""]
[7,null,null,null,null,null,null,null,null,null,null,null,null,null,null,null,null,null,null,null,8,"Recht 7",null,{"$f":"IFERROR(VLOOKUP($C110,Blad3!$F$31:$F$61,1,FALSE),IF($C110<>\"\",\"ANDERE\",\"\"))","v":""},{"$f":"IF(ISERROR(VLOOKUP($C110,Blad3!$F$31:$F$61,1,FALSE)),IF($C110<>\"\",$C110,\"\"),\"\")","v":""},6,"Recht 7",{"$f":"IF(B110=\"\",\"\",B110)","v":""},"","","","","","","","","","","","","","","","","","",101,null,null,null,null,null,null,"/","","","","","","","","","","","","","","","","","","",""]
[8,null,null,null,null,null,null,null,null,null,null,null,null,null,null,null,null,null,null,null,9,"Recht 8",null,{"$f":"IFERROR(VLOOKUP($C111,Blad3!$F$31:$F$61,1,FALSE),IF($C111<>\"\",\"ANDERE\",\"\"))","v":""},{"$f":"IF(ISERROR(VLOOKUP($C111,Blad3!$F$31:$F$61,1,FALSE)),IF($C111<>\"\",$C111,\"\"),\"\")","v":""},6,"Recht 8","","","","","","","","","","","","","","","","","","","",102,null,null,null,null,null,null,"/","","","","","","","","","","","","","","","","","","",""]
[9,null,null,null,null,null,null,null,null,null,null,null,null,null,null,null,null,null,null,null,10,"Recht 9",null,{"$f":"IFERROR(VLOOKUP($C112,Blad3!$F$31:$F$61,1,FALSE),IF($C112<>\"\",\"ANDERE\",\"\"))","v":""},{"$f":"IF(ISERROR(VLOOKUP($C112,Blad3!$F$31:$F$61,1,FALSE)),IF($C112<>\"\",$C112,\"\"),\"\")","v":""},6,"Recht 9","","","","","","","","","","","","","","","","","","","",103,null,null,null,null,null,null,"/","","","","","","","","","","","","","","","","","","",""]
[10,null,null,null,null,null,null,null,null,null,null,null,null,null,null,null,null,null,null,null,11,"Recht 10",null,{"$f":"IFERROR(VLOOKUP($C113,Blad3!$F$31:$F$61,1,FALSE),IF($C113<>\"\",\"ANDERE\",\"\"))","v":""},{"$f":"IF(ISERROR(VLOOKUP($C113,Blad3!$F$31:$F$61,1,FALSE)),IF($C113<>\"\",$C113,\"\"),\"\")","v":""},6,"Recht 10","","","","","","","","","","","","","","","","","","","",104,null,null,null,null,null,null,"/","","","","","","","","","","","","","","","","","","",""]
[11,null,null,null,null,null,null,null,null,null,null,null,null,null,null,null,null,null,null,null,12,"Recht 11",null,{"$f":"IFERROR(VLOOKUP($C114,Blad3!$F$31:$F$61,1,FALSE),IF($C114<>\"\",\"ANDERE\",\"\"))","v":""},{"$f":"IF(ISERROR(VLOOKUP($C114,Blad3!$F$31:$F$61,1,FALSE)),IF($C114<>\"\",$C114,\"\"),\"\")","v":""},6,"Recht 11","","","","","","","","","","","","","","","","","","","",105,null,null,null,null,null,null,"/","","","","","","","","","","","","","","","","","","",""]
[12,null,null,null,null,null,null,null,null,null,null,null,null,null,null,null,null,null,null,null,13,"Recht 12",null,{"$f":"IFERROR(VLOOKUP($C115,Blad3!$F$31:$F$61,1,FALSE),IF($C115<>\"\",\"ANDERE\",\"\"))","v":""},{"$f":"IF(ISERROR(VLOOKUP($C115,Blad3!$F$31:$F$61,1,FALSE)),IF($C115<>\"\",$C115,\"\"),\"\")","v":""},6,"Recht 12","","","","","","","","","","","","","","","","","","","",106,null,null,null,null,null,null,"/","","","","","","","","","","","","","","","","","","",""]
[13,null,null,null,null,null,null,null,null,null,null,null,null,null,null,null,null,null,null,null,14,"Recht 13",null,{"$f":"IFERROR(VLOOKUP($C116,Blad3!$F$31:$F$61,1,FALSE),IF($C116<>\"\",\"ANDERE\",\"\"))","v":""},{"$f":"IF(ISERROR(VLOOKUP($C116,Blad3!$F$31:$F$61,1,FALSE)),IF($C116<>\"\",$C116,\"\"),\"\")","v":""},6,"Recht 13","","","","","","","","","","","","","","","","","","","",107,null,null,null,null,null,null,"/","","","","","","","","","","","","","","","","","","",""]
[14,null,null,null,null,null,null,null,null,null,null,null,null,null,null,null,null,null,null,null,15,"Recht 14",null,{"$f":"IFERROR(VLOOKUP($C117,Blad3!$F$31:$F$61,1,FALSE),IF($C117<>\"\",\"ANDERE\",\"\"))","v":""},{"$f":"IF(ISERROR(VLOOKUP($C117,Blad3!$F$31:$F$61,1,FALSE)),IF($C117<>\"\",$C117,\"\"),\"\")","v":""},6,"Recht 14","","","","","","","","","","","","","","","","","","","",108,null,null,null,null,null,null,"/","","","","","","","","","","","","","","","","","","",""]
[15,null,null,null,null,null,null,null,null,null,null,null,null,null,null,null,null,null,null,null,16,"Recht 15",null,{"$f":"IFERROR(VLOOKUP($C118,Blad3!$F$31:$F$61,1,FALSE),IF($C118<>\"\",\"ANDERE\",\"\"))","v":""},{"$f":"IF(ISERROR(VLOOKUP($C118,Blad3!$F$31:$F$61,1,FALSE)),IF($C118<>\"\",$C118,\"\"),\"\")","v":""},6,"Recht 15","","","","","","","","","","","","","","","","","","","",109,null,null,null,null,null,null,"/","","","","","","","","","","","","","","","","","","",""]
[16,null,null,null,null,null,null,null,null,null,null,null,null,null,null,null,null,null,null,null,17,"Recht 16",null,{"$f":"IFERROR(VLOOKUP($C119,Blad3!$F$31:$F$61,1,FALSE),IF($C119<>\"\",\"ANDERE\",\"\"))","v":""},{"$f":"IF(ISERROR(VLOOKUP($C119,Blad3!$F$31:$F$61,1,FALSE)),IF($C119<>\"\",$C119,\"\"),\"\")","v":""},6,"Recht 16","","","","","","","","","","","","","","","","","","","",110,null,null,null,null,null,null,"/","","","","","","","","","","","","","","","","","","",""]
[17,null,null,null,null,null,null,null,null,null,null,null,null,null,null,null,null,null,null,null,18,"Recht 17",null,{"$f":"IFERROR(VLOOKUP($C120,Blad3!$F$31:$F$61,1,FALSE),IF($C120<>\"\",\"ANDERE\",\"\"))","v":""},{"$f":"IF(ISERROR(VLOOKUP($C120,Blad3!$F$31:$F$61,1,FALSE)),IF($C120<>\"\",$C120,\"\"),\"\")","v":""},6,"Recht 17","","","","","","","","","","","","","","","","","","","",111,null,null,null,null,null,null,"/","","","","","","","","","","","","","","","","","","",""]
[18,null,null,null,null,null,null,null,null,null,null,null,null,null,null,null,null,null,null,null,19,"Recht 18",null,{"$f":"IFERROR(VLOOKUP($C121,Blad3!$F$31:$F$61,1,FALSE),IF($C121<>\"\",\"ANDERE\",\"\"))","v":""},{"$f":"IF(ISERROR(VLOOKUP($C121,Blad3!$F$31:$F$61,1,FALSE)),IF($C121<>\"\",$C121,\"\"),\"\")","v":""},6,"Recht 18","","","","","","","","","","","","","","","","","","","",112,null,null,null,null,null,null,"/","","","","","","","","","","","","","","","","","","",""]
[19,null,null,null,null,null,null,null,null,null,null,null,null,null,null,null,null,null,null,null,20,"Recht 19",null,{"$f":"IFERROR(VLOOKUP($C122,Blad3!$F$31:$F$61,1,FALSE),IF($C122<>\"\",\"ANDERE\",\"\"))","v":""},{"$f":"IF(ISERROR(VLOOKUP($C122,Blad3!$F$31:$F$61,1,FALSE)),IF($C122<>\"\",$C122,\"\"),\"\")","v":""},6,"Recht 19","","","","","","","","","","","","","","","","","","","",113,null,null,null,null,null,null,"/","","","","","","","","","","","","","","","","","","",""]
[20,null,null,null,null,null,null,null,null,null,null,null,null,null,null,null,null,null,null,null,1,"Recht 20",null,{"$f":"IFERROR(VLOOKUP($C123,Blad3!$F$31:$F$61,1,FALSE),IF($C123<>\"\",\"ANDERE\",\"\"))","v":""},{"$f":"IF(ISERROR(VLOOKUP($C123,Blad3!$F$31:$F$61,1,FALSE)),IF($C123<>\"\",$C123,\"\"),\"\")","v":""},6,"Recht 20","","","","","","","","","","","","","","","","","","","",114,null,null,null,null,null,null,"/","","","","","","","","","","","","","","","","","","",""]
[1,null,null,null,null,null,null,null,null,null,null,null,null,null,null,null,null,null,null,null,2,"Hoop 1",null,{"$f":"IFERROR(VLOOKUP($C124,Blad3!$F$31:$F$61,1,FALSE),IF($C124<>\"\",\"ANDERE\",\"\"))","v":""},{"$f":"IF(ISERROR(VLOOKUP($C124,Blad3!$F$31:$F$61,1,FALSE)),IF($C124<>\"\",$C124,\"\"),\"\")","v":""},6,"Hoop 1","","","","","","","","","","","","","","","","","","","",115,null,null,null,null,null,null,"/","","","","","","","","","","","","","","","","","","",""]
[2,null,null,null,null,null,null,null,null,null,null,null,null,null,null,null,null,null,null,null,3,"Hoop 2",null,{"$f":"IFERROR(VLOOKUP($C125,Blad3!$F$31:$F$61,1,FALSE),IF($C125<>\"\",\"ANDERE\",\"\"))","v":""},{"$f":"IF(ISERROR(VLOOKUP($C125,Blad3!$F$31:$F$61,1,FALSE)),IF($C125<>\"\",$C125,\"\"),\"\")","v":""},6,"Hoop 2","","","","","","","","","","","","","","","","","","","",116,null,null,null,null,null,null,"/","","","","","","","","","","","","","","","","","","",""]
[3,null,null,null,null,null,null,null,null,null,null,null,null,null,null,null,null,null,null,null,4,"Hoop 3",null,{"$f":"IFERROR(VLOOKUP($C126,Blad3!$F$31:$F$61,1,FALSE),IF($C126<>\"\",\"ANDERE\",\"\"))","v":""},{"$f":"IF(ISERROR(VLOOKUP($C126,Blad3!$F$31:$F$61,1,FALSE)),IF($C126<>\"\",$C126,\"\"),\"\")","v":""},6,"Hoop 3","","","","","","","","","","","","","","","","","","","",117,null,null,null,null,null,null,"/","","","","","","","","","","","","","","","","","","",""]
[4,null,null,null,null,null,null,null,null,null,null,null,null,null,null,null,null,null,null,null,5,"Hoop 4",null,{"$f":"IFERROR(VLOOKUP($C127,Blad3!$F$31:$F$61,1,FALSE),IF($C127<>\"\",\"ANDERE\",\"\"))","v":""},{"$f":"IF(ISERROR(VLOOKUP($C127,Blad3!$F$31:$F$61,1,FALSE)),IF($C127<>\"\",$C127,\"\"),\"\")","v":""},6,"Hoop 4","","","","","","","","","","","","","","","","","","","",118,null,null,null,null,null,null,"/","","","","","","","","","","","","","","","","","","",""]
[5,null,null,null,null,null,null,null,null,null,null,null,null,null,null,null,null,null,null,null,6,"Hoop 5",null,{"$f":"IFERROR(VLOOKUP($C128,Blad3!$F$31:$F$61,1,FALSE),IF($C128<>\"\",\"ANDERE\",\"\"))","v":""},{"$f":"IF(ISERROR(VLOOKUP($C128,Blad3!$F$31:$F$61,1,FALSE)),IF($C128<>\"\",$C128,\"\"),\"\")","v":""},6,"Hoop 5","","","","","","","","","","","","","","","","","","","",119,null,null,null,null,null,null,"/","","","","","","","","","","","","","","","","","","",""]
[6,null,null,null,null,null,null,null,null,null,null,null,null,null,null,null,null,null,null,null,7,"Hoop 6",null,{"$f":"IFERROR(VLOOKUP($C129,Blad3!$F$31:$F$61,1,FALSE),IF($C129<>\"\",\"ANDERE\",\"\"))","v":""},{"$f":"IF(ISERROR(VLOOKUP($C129,Blad3!$F$31:$F$61,1,FALSE)),IF($C129<>\"\",$C129,\"\"),\"\")","v":""},6,"Hoop 6","","","","","","","","","","","","","","","","","","","",120,null,null,null,null,null,null,"/","","","","","","","","","","","","","","","","","","",""]
[7,null,null,null,null,null,null,null,null,null,null,null,null,null,null,null,null,null,null,null,8,"Hoop 7",null,{"$f":"IFERROR(VLOOKUP($C130,Blad3!$F$31:$F$61,1,FALSE),IF($C130<>\"\",\"ANDERE\",\"\"))","v":""},{"$f":"IF(ISERROR(VLOOKUP($C130,Blad3!$F$31:$F$61,1,FALSE)),IF($C130<>\"\",$C130,\"\"),\"\")","v":""},6,"Hoop 7","","","","","","","","","","","","","","","","","","","",121,null,null,null,null,null,null,"/","","","","","","","","","","","","","","","","","","",""]
[8,null,null,null,null,null,null,null,null,null,null,null,null,null,null,null,null,null,null,null,9,"Hoop 8",null,{"$f":"IFERROR(VLOOKUP($C131,Blad3!$F$31:$F$61,1,FALSE),IF($C131<>\"\",\"ANDERE\",\"\"))","v":""},{"$f":"IF(ISERROR(VLOOKUP($C131,Blad3!$F$31:$F$61,1,FALSE)),IF($C131<>\"\",$C131,\"\"),\"\")","v":""},6,"Hoop 8","","","","","","","","","","","","","","","","","","","",122,null,null,null,null,null,null,"/","","","","","","","","","","","","","","","","","","",""]
[9,null,null,null,null,null,null,null,null,null,null,null,null,null,null,null,null,null,null,null,10,"Hoop 9",null,{"$f":"IFERROR(VLOOKUP($C132,Blad3!$F$31:$F$61,1,FALSE),IF($C132<>\"\",\"ANDERE\",\"\"))","v":""},{"$f":"IF(ISERROR(VLOOKUP($C132,Blad3!$F$31:$F$61,1,FALSE)),IF($C132<>\"\",$C132,\"\"),\"\")","v":""},6,"Hoop 9","","","","","","","","","","","","","","","","","","","",123,null,null,null,null,null,null,"/","","","","","","","","","","","","","","","","","","",""]
[10,null,null,null,null,null,null,null,null,null,null,null,null,null,null,null,null,null,null,null,11,"Hoop 10",null,{"$f":"IFERROR(VLOOKUP($C133,Blad3!$F$31:$F$61,1,FALSE),IF($C133<>\"\",\"ANDERE\",\"\"))","v":""},{"$f":"IF(ISERROR(VLOOKUP($C133,Blad3!$F$31:$F$61,1,FALSE)),IF($C133<>\"\",$C133,\"\"),\"\")","v":""},6,"Hoop 10","","","","","","","","","","","","","","","","","","","",124,null,null,null,null,null,null,"/","","","","","","","","","","","","","","","","","","",""]
[11,null,null,null,null,null,null,null,null,null,null,null,null,null,null,null,null,null,null,null,12,"Hoop 11",null,{"$f":"IFERROR(VLOOKUP($C134,Blad3!$F$31:$F$61,1,FALSE),IF($C134<>\"\",\"ANDERE\",\"\"))","v":""},{"$f":"IF(ISERROR(VLOOKUP($C134,Blad3!$F$31:$F$61,1,FALSE)),IF($C134<>\"\",$C134,\"\"),\"\")","v":""},6,"Hoop 11","","","","","","","","","","","","","","","","","","","",125,null,null,null,null,null,null,"/","","","","","","","","","","","","","","","","","","",""]
[12,null,null,null,null,null,null,null,null,null,null,null,null,null,null,null,null,null,null,null,13,"Hoop 12",null,{"$f":"IFERROR(VLOOKUP($C135,Blad3!$F$31:$F$61,1,FALSE),IF($C135<>\"\",\"ANDERE\",\"\"))","v":""},{"$f":"IF(ISERROR(VLOOKUP($C135,Blad3!$F$31:$F$61,1,FALSE)),IF($C135<>\"\",$C135,\"\"),\"\")","v":""},6,"Hoop 12","","","","","","","","","","","","","","","","","","","",126,null,null,null,null,null,null,"/","","","","","","","","","","","","","","","","","","",""]
[13,null,null,null,null,null,null,null,null,null,null,null,null,null,null,null,null,null,null,null,14,"Hoop 13",null,{"$f":"IFERROR(VLOOKUP($C136,Blad3!$F$31:$F$61,1,FALSE),IF($C136<>\"\",\"ANDERE\",\"\"))","v":""},{"$f":"IF(ISERROR(VLOOKUP($C136,Blad3!$F$31:$F$61,1,FALSE)),IF($C136<>\"\",$C136,\"\"),\"\")","v":""},6,{"$f":"IF(V136=\"\",\"\",V136)","v":"Hoop 13"},"","","","","","","","","","","","","","","","","","","",127,null,null,null,null,null,null,"/","","","","","","","","","","","","","","","","","","",""]
[14,null,null,null,null,null,null,null,null,null,null,null,null,null,null,null,null,null,null,null,15,"Hoop 14",null,{"$f":"IFERROR(VLOOKUP($C137,Blad3!$F$31:$F$61,1,FALSE),IF($C137<>\"\",\"ANDERE\",\"\"))","v":""},{"$f":"IF(ISERROR(VLOOKUP($C137,Blad3!$F$31:$F$61,1,FALSE)),IF($C137<>\"\",$C137,\"\"),\"\")","v":""},6,"Hoop 14","","","","","","","","","","","","","","","","","","","",128,null,null,null,null,null,null,"/","","","","","","","","","","","","","","","","","","",""]
[15,null,null,null,null,null,null,null,null,null,null,null,null,null,null,null,null,null,null,null,16,"Hoop 15",null,{"$f":"IFERROR(VLOOKUP($C138,Blad3!$F$31:$F$61,1,FALSE),IF($C138<>\"\",\"ANDERE\",\"\"))","v":""},{"$f":"IF(ISERROR(VLOOKUP($C138,Blad3!$F$31:$F$61,1,FALSE)),IF($C138<>\"\",$C138,\"\"),\"\")","v":""},6,"Hoop 15","","","","","","","","","","","","","","","","","","","",129,null,null,null,null,null,null,"/",{"$f":"IFERROR(VLOOKUP($AU138,$Z$10:$AT$203,AB$9,FALSE),\"\")","v":""},{"$f":"IFERROR(VLOOKUP($AU138,$Z$10:$AT$203,AC$9,FALSE),\"\")","v":""},{"$f":"IFERROR(VLOOKUP($AU138,$Z$10:$AT$203,AD$9,FALSE),\"\")","v":""},{"$f":"IFERROR(VLOOKUP($AU138,$Z$10:$AT$203,AE$9,FALSE),\"\")","v":""},{"$f":"IFERROR(VLOOKUP($AU138,$Z$10:$AT$203,AF$9,FALSE),\"\")","v":""},{"$f":"IFERROR(VLOOKUP($AU138,$Z$10:$AT$203,AG$9,FALSE),\"\")","v":""},{"$f":"IFERROR(VLOOKUP($AU138,$Z$10:$AT$203,AH$9,FALSE),\"\")","v":""},{"$f":"IFERROR(VLOOKUP($AU138,$Z$10:$AT$203,AI$9,FALSE),\"\")","v":""},{"$f":"IFERROR(VLOOKUP($AU138,$Z$10:$AT$203,AJ$9,FALSE),\"\")","v":""},{"$f":"IFERROR(VLOOKUP($AU138,$Z$10:$AT$203,AK$9,FALSE),\"\")","v":""},{"$f":"IFERROR(VLOOKUP($AU138,$Z$10:$AT$203,AL$9,FALSE),\"\")","v":""},{"$f":"IFERROR(VLOOKUP($AU138,$Z$10:$AT$203,AM$9,FALSE),\"\")","v":""},{"$f":"IFERROR(VLOOKUP($AU138,$Z$10:$AT$203,AN$9,FALSE),\"\")","v":""},{"$f":"IFERROR(VLOOKUP($AU138,$Z$10:$AT$203,AO$9,FALSE),\"\")","v":""},{"$f":"IFERROR(VLOOKUP($AU138,$Z$10:$AT$203,AP$9,FALSE),\"\")","v":""},{"$f":"IFERROR(VLOOKUP($AU138,$Z$10:$AT$203,AQ$9,FALSE),\"\")","v":""},{"$f":"IFERROR(VLOOKUP($AU138,$Z$10:$AT$203,AR$9,FALSE),\"\")","v":""},{"$f":"IFERROR(VLOOKUP($AU138,$Z$10:$AT$203,AS$9,FALSE),\"\")","v":""},""]
[16,null,null,null,null,null,null,null,null,null,null,null,null,null,null,null,null,null,null,null,17,"Hoop 16",null,{"$f":"IFERROR(VLOOKUP($C139,Blad3!$F$31:$F$61,1,FALSE),IF($C139<>\"\",\"ANDERE\",\"\"))","v":""},{"$f":"IF(ISERROR(VLOOKUP($C139,Blad3!$F$31:$F$61,1,FALSE)),IF($C139<>\"\",$C139,\"\"),\"\")","v":""},6,"Hoop 16","","","","","","","","","","","","","","","","","","","",130,null,null,null,null,null,null,{"$f":"IFERROR(VLOOKUP($AU139,$Z$10:$AT$203,AA$9,FALSE),\"/\")","v":"/"},"","","","","","","","","","","","","","","","","","",""]
[17,null,null,null,null,null,null,null,null,null,null,null,null,null,null,null,null,null,null,null,18,"Hoop 17",null,{"$f":"IFERROR(VLOOKUP($C140,Blad3!$F$31:$F$61,1,FALSE),IF($C140<>\"\",\"ANDERE\",\"\"))","v":""},{"$f":"IF(ISERROR(VLOOKUP($C140,Blad3!$F$31:$F$61,1,FALSE)),IF($C140<>\"\",$C140,\"\"),\"\")","v":""},{"$f":"IF(B140<>\"\",Z139+1,Z139)","v":6},"Hoop 17","","","","","","","","","","","","","","","","","","","",131,null,null,null,null,null,null,"/","","","","","","","","","","","","","","","","","","",""]
[18,null,null,null,null,null,null,null,null,null,null,null,null,null,null,null,null,null,null,null,19,"Hoop 18",null,{"$f":"IFERROR(VLOOKUP($C141,Blad3!$F$31:$F$61,1,FALSE),IF($C141<>\"\",\"ANDERE\",\"\"))","v":""},{"$f":"IF(ISERROR(VLOOKUP($C141,Blad3!$F$31:$F$61,1,FALSE)),IF($C141<>\"\",$C141,\"\"),\"\")","v":""},6,"Hoop 18","","","","","","","","","","","","","","","","","","","",132,null,null,null,null,null,null,"/","","","","","","","","","","","","","","","","","","",""]
[19,null,null,null,null,null,null,null,null,null,null,null,null,null,null,null,null,null,null,null,20,"Hoop 19",null,{"$f":"IFERROR(VLOOKUP($C142,Blad3!$F$31:$F$61,1,FALSE),IF($C142<>\"\",\"ANDERE\",\"\"))","v":""},{"$f":"IF(ISERROR(VLOOKUP($C142,Blad3!$F$31:$F$61,1,FALSE)),IF($C142<>\"\",$C142,\"\"),\"\")","v":""},6,"Hoop 19",{"$f":"IF(B142=\"\",\"\",B142)","v":""},"","","","","","","","","","","","","","","","","","",133,null,null,null,null,null,null,"/","","","","","","","","","","","","","","","","","","",""]
[20,null,null,null,null,null,null,null,null,null,null,null,null,null,null,null,null,null,null,null,1,"Hoop 20",null,{"$f":"IFERROR(VLOOKUP($C143,Blad3!$F$31:$F$61,1,FALSE),IF($C143<>\"\",\"ANDERE\",\"\"))","v":""},{"$f":"IF(ISERROR(VLOOKUP($C143,Blad3!$F$31:$F$61,1,FALSE)),IF($C143<>\"\",$C143,\"\"),\"\")","v":""},6,"Hoop 20","","","","","","","","","","","","","","","","","","","",134,null,null,null,null,null,null,"/","","","","","","","","","","","","","","","","","","",""]
[1,null,null,null,null,null,null,null,null,null,null,null,null,null,null,null,null,null,null,null,2,"Afgetopte hoop 1",null,{"$f":"IFERROR(VLOOKUP($C144,Blad3!$F$31:$F$61,1,FALSE),IF($C144<>\"\",\"ANDERE\",\"\"))","v":""},{"$f":"IF(ISERROR(VLOOKUP($C144,Blad3!$F$31:$F$61,1,FALSE)),IF($C144<>\"\",$C144,\"\"),\"\")","v":""},6,"Afgetopte hoop 1","","","","","","","","","","","","","","","","","","","",135,null,null,null,null,null,null,"/","","","","","","","","","","","","","","","","","","",""]
[2,null,null,null,null,null,null,null,null,null,null,null,null,null,null,null,null,null,null,null,3,"Afgetopte hoop 2",null,{"$f":"IFERROR(VLOOKUP($C145,Blad3!$F$31:$F$61,1,FALSE),IF($C145<>\"\",\"ANDERE\",\"\"))","v":""},{"$f":"IF(ISERROR(VLOOKUP($C145,Blad3!$F$31:$F$61,1,FALSE)),IF($C145<>\"\",$C145,\"\"),\"\")","v":""},6,"Afgetopte hoop 2","","","","","","","","","","","","","","","","","","","",136,null,null,null,null,null,null,"/","","","","","","","","","","","","","","","","","","",""]
[3,null,null,null,null,null,null,null,null,null,null,null,null,null,null,null,null,null,null,null,4,"Afgetopte hoop 3",null,{"$f":"IFERROR(VLOOKUP($C146,Blad3!$F$31:$F$61,1,FALSE),IF($C146<>\"\",\"ANDERE\",\"\"))","v":""},{"$f":"IF(ISERROR(VLOOKUP($C146,Blad3!$F$31:$F$61,1,FALSE)),IF($C146<>\"\",$C146,\"\"),\"\")","v":""},6,"Afgetopte hoop 3","","","","","","","","","","","","","","","","","","","",137,null,null,null,null,null,null,"/","","","","","","","","","","","","","","","","","","",""]
[4,null,null,null,null,null,null,null,null,null,null,null,null,null,null,null,null,null,null,null,5,"Afgetopte hoop 4",null,{"$f":"IFERROR(VLOOKUP($C147,Blad3!$F$31:$F$61,1,FALSE),IF($C147<>\"\",\"ANDERE\",\"\"))","v":""},{"$f":"IF(ISERROR(VLOOKUP($C147,Blad3!$F$31:$F$61,1,FALSE)),IF($C147<>\"\",$C147,\"\"),\"\")","v":""},6,"Afgetopte hoop 4","","","","","","","","","","","","","","","","","","","",138,null,null,null,null,null,null,"/","","","","","","","","","","","","","","","","","","",""]
[5,null,null,null,null,null,null,null,null,null,null,null,null,null,null,null,null,null,null,null,6,"Afgetopte hoop 5",null,{"$f":"IFERROR(VLOOKUP($C148,Blad3!$F$31:$F$61,1,FALSE),IF($C148<>\"\",\"ANDERE\",\"\"))","v":""},{"$f":"IF(ISERROR(VLOOKUP($C148,Blad3!$F$31:$F$61,1,FALSE)),IF($C148<>\"\",$C148,\"\"),\"\")","v":""},6,"Afgetopte hoop 5","","","","","","","","","","","","","","","","","","","",139,null,null,null,null,null,null,"/","","","","","","","","","","","","","","","","","","",""]
[6,null,null,null,null,null,null,null,null,null,null,null,null,null,null,null,null,null,null,null,7,"Afgetopte hoop 6",null,{"$f":"IFERROR(VLOOKUP($C149,Blad3!$F$31:$F$61,1,FALSE),IF($C149<>\"\",\"ANDERE\",\"\"))","v":""},{"$f":"IF(ISERROR(VLOOKUP($C149,Blad3!$F$31:$F$61,1,FALSE)),IF($C149<>\"\",$C149,\"\"),\"\")","v":""},6,"Afgetopte hoop 6","","","","","","","","","","","","","","","","","","","",140,null,null,null,null,null,null,"/","","","","","","","","","","","","","","","","","","",""]
[7,null,null,null,null,null,null,null,null,null,null,null,null,null,null,null,null,null,null,null,8,"Afgetopte hoop 7",null,{"$f":"IFERROR(VLOOKUP($C150,Blad3!$F$31:$F$61,1,FALSE),IF($C150<>\"\",\"ANDERE\",\"\"))","v":""},{"$f":"IF(ISERROR(VLOOKUP($C150,Blad3!$F$31:$F$61,1,FALSE)),IF($C150<>\"\",$C150,\"\"),\"\")","v":""},6,"Afgetopte hoop 7","","","","","","","","","","","","","","","","","","","",141,null,null,null,null,null,null,"/","","","","","","","","","","","","","","","","","","",""]
[8,null,null,null,null,null,null,null,null,null,null,null,null,null,null,null,null,null,null,null,9,"Afgetopte hoop 8",null,{"$f":"IFERROR(VLOOKUP($C151,Blad3!$F$31:$F$61,1,FALSE),IF($C151<>\"\",\"ANDERE\",\"\"))","v":""},{"$f":"IF(ISERROR(VLOOKUP($C151,Blad3!$F$31:$F$61,1,FALSE)),IF($C151<>\"\",$C151,\"\"),\"\")","v":""},6,"Afgetopte hoop 8","","","","","","","","","","","","","","","","","","","",142,null,null,null,null,null,null,"/","","","","","","","","","","","","","","","","","","",""]
[9,null,null,null,null,null,null,null,null,null,null,null,null,null,null,null,null,null,null,null,10,"Afgetopte hoop 9",null,{"$f":"IFERROR(VLOOKUP($C152,Blad3!$F$31:$F$61,1,FALSE),IF($C152<>\"\",\"ANDERE\",\"\"))","v":""},{"$f":"IF(ISERROR(VLOOKUP($C152,Blad3!$F$31:$F$61,1,FALSE)),IF($C152<>\"\",$C152,\"\"),\"\")","v":""},6,"Afgetopte hoop 9","","","","","","","","","","","","","","","","","","","",143,null,null,null,null,null,null,"/","","","","","","","","","","","","","","","","","","",""]
[10,null,null,null,null,null,null,null,null,null,null,null,null,null,null,null,null,null,null,null,11,"Afgetopte hoop 10",null,{"$f":"IFERROR(VLOOKUP($C153,Blad3!$F$31:$F$61,1,FALSE),IF($C153<>\"\",\"ANDERE\",\"\"))","v":""},{"$f":"IF(ISERROR(VLOOKUP($C153,Blad3!$F$31:$F$61,1,FALSE)),IF($C153<>\"\",$C153,\"\"),\"\")","v":""},6,"Afgetopte hoop 10","","","","","","","","","","","","","","","","","","","",144,null,null,null,null,null,null,"/","","","","","","","","","","","","","","","","","","",""]
[11,null,null,null,null,null,null,null,null,null,null,null,null,null,null,null,null,null,null,null,12,"Afgetopte hoop 11",null,{"$f":"IFERROR(VLOOKUP($C154,Blad3!$F$31:$F$61,1,FALSE),IF($C154<>\"\",\"ANDERE\",\"\"))","v":""},{"$f":"IF(ISERROR(VLOOKUP($C154,Blad3!$F$31:$F$61,1,FALSE)),IF($C154<>\"\",$C154,\"\"),\"\")","v":""},6,"Afgetopte hoop 11","","","","","","","","","","","","","","","","","","","",145,null,null,null,null,null,null,"/","","","","","","","","","","","","","","","","","","",""]
[12,null,null,null,null,null,null,null,null,null,null,null,null,null,null,null,null,null,null,null,13,"Afgetopte hoop 12",null,{"$f":"IFERROR(VLOOKUP($C155,Blad3!$F$31:$F$61,1,FALSE),IF($C155<>\"\",\"ANDERE\",\"\"))","v":""},{"$f":"IF(ISERROR(VLOOKUP($C155,Blad3!$F$31:$F$61,1,FALSE)),IF($C155<>\"\",$C155,\"\"),\"\")","v":""},6,"Afgetopte hoop 12","","","","","","","","","","","","","","","","","","","",146,null,null,null,null,null,null,"/","","","","","","","","","","","","","","","","","","",""]
[13,null,null,null,null,null,null,null,null,null,null,null,null,null,null,null,null,null,null,null,14,"Afgetopte hoop 13",null,{"$f":"IFERROR(VLOOKUP($C156,Blad3!$F$31:$F$61,1,FALSE),IF($C156<>\"\",\"ANDERE\",\"\"))","v":""},{"$f":"IF(ISERROR(VLOOKUP($C156,Blad3!$F$31:$F$61,1,FALSE)),IF($C156<>\"\",$C156,\"\"),\"\")","v":""},6,"Afgetopte hoop 13","","","","","","","","","","","","","","","","","","","",147,null,null,null,null,null,null,"/","","","","","","","","","","","","","","","","","","",""]
[14,null,null,null,null,null,null,null,null,null,null,null,null,null,null,null,null,null,null,null,15,"Afgetopte hoop 14",null,{"$f":"IFERROR(VLOOKUP($C157,Blad3!$F$31:$F$61,1,FALSE),IF($C157<>\"\",\"ANDERE\",\"\"))","v":""},{"$f":"IF(ISERROR(VLOOKUP($C157,Blad3!$F$31:$F$61,1,FALSE)),IF($C157<>\"\",$C157,\"\"),\"\")","v":""},6,"Afgetopte hoop 14","","","","","","","","","","","","","","","","","","","",148,null,null,null,null,null,null,"/","","","","","","","","","","","","","","","","","","",""]
[15,null,null,null,null,null,null,null,null,null,null,null,null,null,null,null,null,null,null,null,16,"Afgetopte hoop 15",null,{"$f":"IFERROR(VLOOKUP($C158,Blad3!$F$31:$F$61,1,FALSE),IF($C158<>\"\",\"ANDERE\",\"\"))","v":""},{"$f":"IF(ISERROR(VLOOKUP($C158,Blad3!$F$31:$F$61,1,FALSE)),IF($C158<>\"\",$C158,\"\"),\"\")","v":""},6,"Afgetopte hoop 15","","","","","","","","","","","","","","","","","","","",149,null,null,null,null,null,null,"/","","","","","","","","","","","","","","","","","","",""]
[16,null,null,null,null,null,null,null,null,null,null,null,null,null,null,null,null,null,null,null,17,"Afgetopte hoop 16",null,{"$f":"IFERROR(VLOOKUP($C159,Blad3!$F$31:$F$61,1,FALSE),IF($C159<>\"\",\"ANDERE\",\"\"))","v":""},{"$f":"IF(ISERROR(VLOOKUP($C159,Blad3!$F$31:$F$61,1,FALSE)),IF($C159<>\"\",$C159,\"\"),\"\")","v":""},6,"Afgetopte hoop 16","","","","","","","","","","","","","","","","","","","",150,null,null,null,null,null,null,"/","","","","","","","","","","","","","","","","","","",""]
[17,null,null,null,null,null,null,null,null,null,null,null,null,null,null,null,null,null,null,null,18,"Afgetopte hoop 17",null,{"$f":"IFERROR(VLOOKUP($C160,Blad3!$F$31:$F$61,1,FALSE),IF($C160<>\"\",\"ANDERE\",\"\"))","v":""},{"$f":"IF(ISERROR(VLOOKUP($C160,Blad3!$F$31:$F$61,1,FALSE)),IF($C160<>\"\",$C160,\"\"),\"\")","v":""},6,"Afgetopte hoop 17","","","","","","","","","","","","","","","","","","","",151,null,null,null,null,null,null,"/","","","","","","","","","","","","","","","","","","",""]
[18,null,null,null,null,null,null,null,null,null,null,null,null,null,null,null,null,null,null,null,19,"Afgetopte hoop 18",null,{"$f":"IFERROR(VLOOKUP($C161,Blad3!$F$31:$F$61,1,FALSE),IF($C161<>\"\",\"ANDERE\",\"\"))","v":""},{"$f":"IF(ISERROR(VLOOKUP($C161,Blad3!$F$31:$F$61,1,FALSE)),IF($C161<>\"\",$C161,\"\"),\"\")","v":""},6,"Afgetopte hoop 18","","","","","","","","","","","","","","","","","","","",152,null,null,null,null,null,null,"/","","","","","","","","","","","","","","","","","","",""]
[19,null,null,null,null,null,null,null,null,null,null,null,null,null,null,null,null,null,null,null,20,"Afgetopte hoop 19",null,{"$f":"IFERROR(VLOOKUP($C162,Blad3!$F$31:$F$61,1,FALSE),IF($C162<>\"\",\"ANDERE\",\"\"))","v":""},{"$f":"IF(ISERROR(VLOOKUP($C162,Blad3!$F$31:$F$61,1,FALSE)),IF($C162<>\"\",$C162,\"\"),\"\")","v":""},6,"Afgetopte hoop 19","","","","","","","","","","","","","","","","","","","",153,null,null,null,null,null,null,"/","","","","","","","","","","","","","","","","","","",""]
[20,null,null,null,null,null,null,null,null,null,null,null,null,null,null,null,null,null,null,null,1,"Afgetopte hoop 20",null,{"$f":"IFERROR(VLOOKUP($C163,Blad3!$F$31:$F$61,1,FALSE),IF($C163<>\"\",\"ANDERE\",\"\"))","v":""},{"$f":"IF(ISERROR(VLOOKUP($C163,Blad3!$F$31:$F$61,1,FALSE)),IF($C163<>\"\",$C163,\"\"),\"\")","v":""},6,"Afgetopte hoop 20","",{"$f":"IF(C163=\"\",\"\",C163)","v":""},{"$f":"IF(D163=\"\",\"\",D163)","v":""},{"$f":"IF(E163=\"\",\"\",E163)","v":""},{"$f":"IF(F163=\"\",\"\",F163)","v":""},{"$f":"IF(G163=\"\",\"\",G163)","v":""},{"$f":"IF(H163=\"\",\"\",H163)","v":""},{"$f":"IF(I163=\"\",\"\",I163)","v":""},{"$f":"IF(J163=\"\",\"\",J163)","v":""},{"$f":"IF(K163=\"\",\"\",K163)","v":""},{"$f":"IF(L163=\"\",\"\",L163)","v":""},{"$f":"IF(M163=\"\",\"\",M163)","v":""},{"$f":"IF(N163=\"\",\"\",N163)","v":""},{"$f":"IF(O163=\"\",\"\",O163)","v":""},{"$f":"IF(P163=\"\",\"\",P163)","v":""},{"$f":"IF(Q163=\"\",\"\",Q163)","v":""},{"$f":"IF(R163=\"\",\"\",R163)","v":""},{"$f":"IF(S163=\"\",\"\",S163)","v":""},{"$f":"IF(T163=\"\",\"\",T163)","v":""},154,null,null,null,null,null,null,"/","","","","","","","","","","","","","","","","","","",""]
[1,null,null,null,null,null,null,null,null,null,null,null,null,null,null,null,null,null,null,null,2,"Lange hoop 1",null,{"$f":"IFERROR(VLOOKUP($C164,Blad3!$F$31:$F$61,1,FALSE),IF($C164<>\"\",\"ANDERE\",\"\"))","v":""},{"$f":"IF(ISERROR(VLOOKUP($C164,Blad3!$F$31:$F$61,1,FALSE)),IF($C164<>\"\",$C164,\"\"),\"\")","v":""},6,"Lange hoop 1","","","","","","","","","","","","","","","","","","","",155,null,null,null,null,null,null,"/","","","","","","","","","","","","","","","","","","",""]
[2,null,null,null,null,null,null,null,null,null,null,null,null,null,null,null,null,null,null,null,3,"Lange hoop 2",null,{"$f":"IFERROR(VLOOKUP($C165,Blad3!$F$31:$F$61,1,FALSE),IF($C165<>\"\",\"ANDERE\",\"\"))","v":""},{"$f":"IF(ISERROR(VLOOKUP($C165,Blad3!$F$31:$F$61,1,FALSE)),IF($C165<>\"\",$C165,\"\"),\"\")","v":""},6,"Lange hoop 2","","","","","","","","","","","","","","","","","","","",156,null,null,null,null,null,null,"/","","","","","","","","","","","","","","","","","","",""]
[3,null,null,null,null,null,null,null,null,null,null,null,null,null,null,null,null,null,null,null,4,"Lange hoop 3",null,{"$f":"IFERROR(VLOOKUP($C166,Blad3!$F$31:$F$61,1,FALSE),IF($C166<>\"\",\"ANDERE\",\"\"))","v":""},{"$f":"IF(ISERROR(VLOOKUP($C166,Blad3!$F$31:$F$61,1,FALSE)),IF($C166<>\"\",$C166,\"\"),\"\")","v":""},6,"Lange hoop 3","","","","","","","","","","","","","","","","","","","",157,null,null,null,null,null,null,"/","","","","","","","","","","","","","","","","","","",""]
[4,null,null,null,null,null,null,null,null,null,null,null,null,null,null,null,null,null,null,null,5,"Lange hoop 4",null,{"$f":"IFERROR(VLOOKUP($C167,Blad3!$F$31:$F$61,1,FALSE),IF($C167<>\"\",\"ANDERE\",\"\"))","v":""},{"$f":"IF(ISERROR(VLOOKUP($C167,Blad3!$F$31:$F$61,1,FALSE)),IF($C167<>\"\",$C167,\"\"),\"\")","v":""},6,"Lange hoop 4","","","","","","","","","","","","","","","","","","","",158,null,null,null,null,null,null,"/","","","","","","","","","","","","","","","","","","",""]
[5,null,null,null,null,null,null,null,null,null,null,null,null,null,null,null,null,null,null,null,6,"Lange hoop 5",null,{"$f":"IFERROR(VLOOKUP($C168,Blad3!$F$31:$F$61,1,FALSE),IF($C168<>\"\",\"ANDERE\",\"\"))","v":""},{"$f":"IF(ISERROR(VLOOKUP($C168,Blad3!$F$31:$F$61,1,FALSE)),IF($C168<>\"\",$C168,\"\"),\"\")","v":""},6,{"$f":"IF(V168=\"\",\"\",V168)","v":"Lange hoop 5"},"","","","","","","","","","","","","","","","","","","",159,null,null,null,null,null,null,"/","","","","","","","","","","","","","","","","","","",""]
[6,null,null,null,null,null,null,null,null,null,null,null,null,null,null,null,null,null,null,null,7,"Lange hoop 6",null,{"$f":"IFERROR(VLOOKUP($C169,Blad3!$F$31:$F$61,1,FALSE),IF($C169<>\"\",\"ANDERE\",\"\"))","v":""},{"$f":"IF(ISERROR(VLOOKUP($C169,Blad3!$F$31:$F$61,1,FALSE)),IF($C169<>\"\",$C169,\"\"),\"\")","v":""},6,"Lange hoop 6","","","","","","","","","","","","","","","","","","","",160,null,null,null,null,null,null,"/","","","","","","","","","","","","","","","","","","",""]
[7,null,null,null,null,null,null,null,null,null,null,null,null,null,null,null,null,null,null,null,8,"Lange hoop 7",null,{"$f":"IFERROR(VLOOKUP($C170,Blad3!$F$31:$F$61,1,FALSE),IF($C170<>\"\",\"ANDERE\",\"\"))","v":""},{"$f":"IF(ISERROR(VLOOKUP($C170,Blad3!$F$31:$F$61,1,FALSE)),IF($C170<>\"\",$C170,\"\"),\"\")","v":""},6,"Lange hoop 7","","","","","","","","","","","","","","","","","","","",161,null,null,null,null,null,null,"/",{"$f":"IFERROR(VLOOKUP($AU170,$Z$10:$AT$203,AB$9,FALSE),\"\")","v":""},{"$f":"IFERROR(VLOOKUP($AU170,$Z$10:$AT$203,AC$9,FALSE),\"\")","v":""},{"$f":"IFERROR(VLOOKUP($AU170,$Z$10:$AT$203,AD$9,FALSE),\"\")","v":""},{"$f":"IFERROR(VLOOKUP($AU170,$Z$10:$AT$203,AE$9,FALSE),\"\")","v":""},{"$f":"IFERROR(VLOOKUP($AU170,$Z$10:$AT$203,AF$9,FALSE),\"\")","v":""},{"$f":"IFERROR(VLOOKUP($AU170,$Z$10:$AT$203,AG$9,FALSE),\"\")","v":""},{"$f":"IFERROR(VLOOKUP($AU170,$Z$10:$AT$203,AH$9,FALSE),\"\")","v":""},{"$f":"IFERROR(VLOOKUP($AU170,$Z$10:$AT$203,AI$9,FALSE),\"\")","v":""},{"$f":"IFERROR(VLOOKUP($AU170,$Z$10:$AT$203,AJ$9,FALSE),\"\")","v":""},{"$f":"IFERROR(VLOOKUP($AU170,$Z$10:$AT$203,AK$9,FALSE),\"\")","v":""},{"$f":"IFERROR(VLOOKUP($AU170,$Z$10:$AT$203,AL$9,FALSE),\"\")","v":""},{"$f":"IFERROR(VLOOKUP($AU170,$Z$10:$AT$203,AM$9,FALSE),\"\")","v":""},{"$f":"IFERROR(VLOOKUP($AU170,$Z$10:$AT$203,AN$9,FALSE),\"\")","v":""},{"$f":"IFERROR(VLOOKUP($AU170,$Z$10:$AT$203,AO$9,FALSE),\"\")","v":""},{"$f":"IFERROR(VLOOKUP($AU170,$Z$10:$AT$203,AP$9,FALSE),\"\")","v":""},{"$f":"IFERROR(VLOOKUP($AU170,$Z$10:$AT$203,AQ$9,FALSE),\"\")","v":""},{"$f":"IFERROR(VLOOKUP($AU170,$Z$10:$AT$203,AR$9,FALSE),\"\")","v":""},{"$f":"IFERROR(VLOOKUP($AU170,$Z$10:$AT$203,AS$9,FALSE),\"\")","v":""},""]
[8,null,null,null,null,null,null,null,null,null,null,null,null,null,null,null,null,null,null,null,9,"Lange hoop 8",null,{"$f":"IFERROR(VLOOKUP($C171,Blad3!$F$31:$F$61,1,FALSE),IF($C171<>\"\",\"ANDERE\",\"\"))","v":""},{"$f":"IF(ISERROR(VLOOKUP($C171,Blad3!$F$31:$F$61,1,FALSE)),IF($C171<>\"\",$C171,\"\"),\"\")","v":""},6,"Lange hoop 8","","","","","","","","","","","","","","","","","","","",162,null,null,null,null,null,null,"/","","","","","","","","","","","","","","","","","","",""]
[9,null,null,null,null,null,null,null,null,null,null,null,null,null,null,null,null,null,null,null,10,"Lange hoop 9",null,{"$f":"IFERROR(VLOOKUP($C172,Blad3!$F$31:$F$61,1,FALSE),IF($C172<>\"\",\"ANDERE\",\"\"))","v":""},{"$f":"IF(ISERROR(VLOOKUP($C172,Blad3!$F$31:$F$61,1,FALSE)),IF($C172<>\"\",$C172,\"\"),\"\")","v":""},6,"Lange hoop 9","","","","","","","","","","","","","","","","","","","",163,null,null,null,null,null,null,"/","","","","","","","","","","","","","","","","","","",""]
[10,null,null,null,null,null,null,null,null,null,null,null,null,null,null,null,null,null,null,null,11,"Lange hoop 10",null,{"$f":"IFERROR(VLOOKUP($C173,Blad3!$F$31:$F$61,1,FALSE),IF($C173<>\"\",\"ANDERE\",\"\"))","v":""},{"$f":"IF(ISERROR(VLOOKUP($C173,Blad3!$F$31:$F$61,1,FALSE)),IF($C173<>\"\",$C173,\"\"),\"\")","v":""},6,"Lange hoop 10","","","","","","","","","","","","","","","","","","","",164,null,null,null,null,null,null,"/","","","","","","","","","","","","","","","","","","",""]
[11,null,null,null,null,null,null,null,null,null,null,null,null,null,null,null,null,null,null,null,12,"Lange hoop 11",null,{"$f":"IFERROR(VLOOKUP($C174,Blad3!$F$31:$F$61,1,FALSE),IF($C174<>\"\",\"ANDERE\",\"\"))","v":""},{"$f":"IF(ISERROR(VLOOKUP($C174,Blad3!$F$31:$F$61,1,FALSE)),IF($C174<>\"\",$C174,\"\"),\"\")","v":""},6,"Lange hoop 11",{"$f":"IF(B174=\"\",\"\",B174)","v":""},"","","","","","","","","","","","","","","","","","",165,null,null,null,null,null,null,"/","","","","","","","","","","","","","","","","","","",""]
[12,null,null,null,null,null,null,null,null,null,null,null,null,null,null,null,null,null,null,null,13,"Lange hoop 12",null,{"$f":"IFERROR(VLOOKUP($C175,Blad3!$F$31:$F$61,1,FALSE),IF($C175<>\"\",\"ANDERE\",\"\"))","v":""},{"$f":"IF(ISERROR(VLOOKUP($C175,Blad3!$F$31:$F$61,1,FALSE)),IF($C175<>\"\",$C175,\"\"),\"\")","v":""},6,"Lange hoop 12","","","","","","","","","","","","","","","","","","","",166,null,null,null,null,null,null,"/","","","","","","","","","","","","","","","","","","",""]
[13,null,null,null,null,null,null,null,null,null,null,null,null,null,null,null,null,null,null,null,14,"Lange hoop 13",null,{"$f":"IFERROR(VLOOKUP($C176,Blad3!$F$31:$F$61,1,FALSE),IF($C176<>\"\",\"ANDERE\",\"\"))","v":""},{"$f":"IF(ISERROR(VLOOKUP($C176,Blad3!$F$31:$F$61,1,FALSE)),IF($C176<>\"\",$C176,\"\"),\"\")","v":""},6,"Lange hoop 13","","","","","","","","","","","","","","","","","","","",167,null,null,null,null,null,null,"/","","","","","","","","","","","","","","","","","","",""]
[14,null,null,null,null,null,null,null,null,null,null,null,null,null,null,null,null,null,null,null,15,"Lange hoop 14",null,{"$f":"IFERROR(VLOOKUP($C177,Blad3!$F$31:$F$61,1,FALSE),IF($C177<>\"\",\"ANDERE\",\"\"))","v":""},{"$f":"IF(ISERROR(VLOOKUP($C177,Blad3!$F$31:$F$61,1,FALSE)),IF($C177<>\"\",$C177,\"\"),\"\")","v":""},6,"Lange hoop 14","","","","","","","","","","","","","","","","","","","",168,null,null,null,null,null,null,"/","","","","","","","","","","","","","","","","","","",""]
[15,null,null,null,null,null,null,null,null,null,null,null,null,null,null,null,null,null,null,null,16,"Lange hoop 15",null,{"$f":"IFERROR(VLOOKUP($C178,Blad3!$F$31:$F$61,1,FALSE),IF($C178<>\"\",\"ANDERE\",\"\"))","v":""},{"$f":"IF(ISERROR(VLOOKUP($C178,Blad3!$F$31:$F$61,1,FALSE)),IF($C178<>\"\",$C178,\"\"),\"\")","v":""},6,"Lange hoop 15","","","","","","","","","","","","","","","","","","","",169,null,null,null,null,null,null,"/","","","","","","","","","","","","","","","","","","",""]
[16,null,null,null,null,null,null,null,null,null,null,null,null,null,null,null,null,null,null,null,17,"Lange hoop 16",null,{"$f":"IFERROR(VLOOKUP($C179,Blad3!$F$31:$F$61,1,FALSE),IF($C179<>\"\",\"ANDERE\",\"\"))","v":""},{"$f":"IF(ISERROR(VLOOKUP($C179,Blad3!$F$31:$F$61,1,FALSE)),IF($C179<>\"\",$C179,\"\"),\"\")","v":""},6,"Lange hoop 16","","","","","","","","","","","","","","","","","","","",170,null,null,null,null,null,null,"/","","","","","","","","","","","","","","","","","","",""]
[17,null,null,null,null,null,null,null,null,null,null,null,null,null,null,null,null,null,null,null,18,"Lange hoop 17",null,{"$f":"IFERROR(VLOOKUP($C180,Blad3!$F$31:$F$61,1,FALSE),IF($C180<>\"\",\"ANDERE\",\"\"))","v":""},{"$f":"IF(ISERROR(VLOOKUP($C180,Blad3!$F$31:$F$61,1,FALSE)),IF($C180<>\"\",$C180,\"\"),\"\")","v":""},6,"Lange hoop 17","","","","","","","","","","","","","","","","","","","",171,null,null,null,null,null,null,"/","","","","","","","","","","","","","","","","","","",""]
[18,null,null,null,null,null,null,null,null,null,null,null,null,null,null,null,null,null,null,null,19,"Lange hoop 18",null,{"$f":"IFERROR(VLOOKUP($C181,Blad3!$F$31:$F$61,1,FALSE),IF($C181<>\"\",\"ANDERE\",\"\"))","v":""},{"$f":"IF(ISERROR(VLOOKUP($C181,Blad3!$F$31:$F$61,1,FALSE)),IF($C181<>\"\",$C181,\"\"),\"\")","v":""},6,"Lange hoop 18","","","","","","","","","","","","","","","","","","","",172,null,null,null,null,null,null,"/","","","","","","","","","","","","","","","","","","",""]
[19,null,null,null,null,null,null,null,null,null,null,null,null,null,null,null,null,null,null,null,20,"Lange hoop 19",null,{"$f":"IFERROR(VLOOKUP($C182,Blad3!$F$31:$F$61,1,FALSE),IF($C182<>\"\",\"ANDERE\",\"\"))","v":""},{"$f":"IF(ISERROR(VLOOKUP($C182,Blad3!$F$31:$F$61,1,FALSE)),IF($C182<>\"\",$C182,\"\"),\"\")","v":""},6,"Lange hoop 19","","","","","","","","","","","","","","","","","","","",173,null,null,null,null,null,null,"/","","","","","","","","","","","","","","","","","","",""]
[20,null,null,null,null,null,null,null,null,null,null,null,null,null,null,null,null,null,null,null,1,"Lange hoop 20",null,{"$f":"IFERROR(VLOOKUP($C183,Blad3!$F$31:$F$61,1,FALSE),IF($C183<>\"\",\"ANDERE\",\"\"))","v":""},{"$f":"IF(ISERROR(VLOOKUP($C183,Blad3!$F$31:$F$61,1,FALSE)),IF($C183<>\"\",$C183,\"\"),\"\")","v":""},6,"Lange hoop 20","","","","","","","","","","","","","","","","","","","",174,null,null,null,null,null,null,"/","","","","","","","","","","","","","","","","","","",""]
[1,null,null,null,null,null,null,null,null,null,null,null,null,null,null,null,null,null,null,null,2,"Mestvaalt 1",null,{"$f":"IFERROR(VLOOKUP($C184,Blad3!$F$31:$F$61,1,FALSE),IF($C184<>\"\",\"ANDERE\",\"\"))","v":""},{"$f":"IF(ISERROR(VLOOKUP($C184,Blad3!$F$31:$F$61,1,FALSE)),IF($C184<>\"\",$C184,\"\"),\"\")","v":""},6,"Mestvaalt 1","","","","","","","","","","","","","","","","","","","",175,null,null,null,null,null,null,"/","","","","","","","","","","","","","","","","","","",""]
[2,null,null,null,null,null,null,null,null,null,null,null,null,null,null,null,null,null,null,null,3,"Mestvaalt 2",null,{"$f":"IFERROR(VLOOKUP($C185,Blad3!$F$31:$F$61,1,FALSE),IF($C185<>\"\",\"ANDERE\",\"\"))","v":""},{"$f":"IF(ISERROR(VLOOKUP($C185,Blad3!$F$31:$F$61,1,FALSE)),IF($C185<>\"\",$C185,\"\"),\"\")","v":""},6,"Mestvaalt 2","","","","","","","","","","","","","","","","","","","",176,null,null,null,null,null,null,"/","","","","","","","","","","","","","","","","","","",""]
[3,null,null,null,null,null,null,null,null,null,null,null,null,null,null,null,null,null,null,null,4,"Mestvaalt 3",null,{"$f":"IFERROR(VLOOKUP($C186,Blad3!$F$31:$F$61,1,FALSE),IF($C186<>\"\",\"ANDERE\",\"\"))","v":""},{"$f":"IF(ISERROR(VLOOKUP($C186,Blad3!$F$31:$F$61,1,FALSE)),IF($C186<>\"\",$C186,\"\"),\"\")","v":""},6,"Mestvaalt 3","","","","","","","","","","","","","","","","","","","",177,null,null,null,null,null,null,"/","","","","","","","","","","","","","","","","","","",""]
[4,null,null,null,null,null,null,null,null,null,null,null,null,null,null,null,null,null,null,null,5,"Mestvaalt 4",null,{"$f":"IFERROR(VLOOKUP($C187,Blad3!$F$31:$F$61,1,FALSE),IF($C187<>\"\",\"ANDERE\",\"\"))","v":""},{"$f":"IF(ISERROR(VLOOKUP($C187,Blad3!$F$31:$F$61,1,FALSE)),IF($C187<>\"\",$C187,\"\"),\"\")","v":""},6,"Mestvaalt 4","","","","","","","","","","","","","","","","","","","",178,null,null,null,null,null,null,"/","","","","","","","","","","","","","","","","","","",""]
[5,null,null,null,null,null,null,null,null,null,null,null,null,null,null,null,null,null,null,null,6,"Mestvaalt 5",null,{"$f":"IFERROR(VLOOKUP($C188,Blad3!$F$31:$F$61,1,FALSE),IF($C188<>\"\",\"ANDERE\",\"\"))","v":""},{"$f":"IF(ISERROR(VLOOKUP($C188,Blad3!$F$31:$F$61,1,FALSE)),IF($C188<>\"\",$C188,\"\"),\"\")","v":""},6,"Mestvaalt 5","","","","","","","","","","","","","","","","","","","",179,null,null,null,null,null,null,"/","","","","","","","","","","","","","","","","","","",""]
[6,null,null,null,null,null,null,null,null,null,null,null,null,null,null,null,null,null,null,null,7,"Mestvaalt 6",null,{"$f":"IFERROR(VLOOKUP($C189,Blad3!$F$31:$F$61,1,FALSE),IF($C189<>\"\",\"ANDERE\",\"\"))","v":""},{"$f":"IF(ISERROR(VLOOKUP($C189,Blad3!$F$31:$F$61,1,FALSE)),IF($C189<>\"\",$C189,\"\"),\"\")","v":""},6,"Mestvaalt 6","","","","","","","","","","","","","","","","","","","",180,null,null,null,null,null,null,"/","","","","","","","","","","","","","","","","","","",""]
[7,null,null,null,null,null,null,null,null,null,null,null,null,null,null,null,null,null,null,null,8,"Mestvaalt 7",null,{"$f":"IFERROR(VLOOKUP($C190,Blad3!$F$31:$F$61,1,FALSE),IF($C190<>\"\",\"ANDERE\",\"\"))","v":""},{"$f":"IF(ISERROR(VLOOKUP($C190,Blad3!$F$31:$F$61,1,FALSE)),IF($C190<>\"\",$C190,\"\"),\"\")","v":""},6,"Mestvaalt 7","","","","","","","","","","","","","","","","","","","",181,null,null,null,null,null,null,"/","","","","","","","","","","","","","","","","","","",""]
[8,null,null,null,null,null,null,null,null,null,null,null,null,null,null,null,null,null,null,null,9,"Mestvaalt 8",null,{"$f":"IFERROR(VLOOKUP($C191,Blad3!$F$31:$F$61,1,FALSE),IF($C191<>\"\",\"ANDERE\",\"\"))","v":""},{"$f":"IF(ISERROR(VLOOKUP($C191,Blad3!$F$31:$F$61,1,FALSE)),IF($C191<>\"\",$C191,\"\"),\"\")","v":""},6,"Mestvaalt 8","","","","","","","","","","","","","","","","","","","",182,null,null,null,null,null,null,"/","","","","","","","","","","","","","","","","","","",""]
[9,null,null,null,null,null,null,null,null,null,null,null,null,null,null,null,null,null,null,null,10,"Mestvaalt 9",null,{"$f":"IFERROR(VLOOKUP($C192,Blad3!$F$31:$F$61,1,FALSE),IF($C192<>\"\",\"ANDERE\",\"\"))","v":""},{"$f":"IF(ISERROR(VLOOKUP($C192,Blad3!$F$31:$F$61,1,FALSE)),IF($C192<>\"\",$C192,\"\"),\"\")","v":""},6,"Mestvaalt 9","","","","","","","","","","","","","","","","","","","",183,null,null,null,null,null,null,"/","","","","","","","","","","","","","","","","","","",""]
[10,null,null,null,null,null,null,null,null,null,null,null,null,null,null,null,null,null,null,null,11,"Mestvaalt 10",null,{"$f":"IFERROR(VLOOKUP($C193,Blad3!$F$31:$F$61,1,FALSE),IF($C193<>\"\",\"ANDERE\",\"\"))","v":""},{"$f":"IF(ISERROR(VLOOKUP($C193,Blad3!$F$31:$F$61,1,FALSE)),IF($C193<>\"\",$C193,\"\"),\"\")","v":""},6,"Mestvaalt 10","","","","","","","","","","","","","","","","","","","",184,null,null,null,null,null,null,"/","","","","","","","","","","","","","","","","","","",""]
[11,null,null,null,null,null,null,null,null,null,null,null,null,null,null,null,null,null,null,null,12,"Mestvaalt 11",null,{"$f":"IFERROR(VLOOKUP($C194,Blad3!$F$31:$F$61,1,FALSE),IF($C194<>\"\",\"ANDERE\",\"\"))","v":""},{"$f":"IF(ISERROR(VLOOKUP($C194,Blad3!$F$31:$F$61,1,FALSE)),IF($C194<>\"\",$C194,\"\"),\"\")","v":""},6,"Mestvaalt 11","","","","","","","","","","","","","","","","","","","",185,null,null,null,null,null,null,"/","","","","","","","","","","","","","","","","","","",""]
[12,null,null,null,null,null,null,null,null,null,null,null,null,null,null,null,null,null,null,null,13,"Mestvaalt 12",null,{"$f":"IFERROR(VLOOKUP($C195,Blad3!$F$31:$F$61,1,FALSE),IF($C195<>\"\",\"ANDERE\",\"\"))","v":""},{"$f":"IF(ISERROR(VLOOKUP($C195,Blad3!$F$31:$F$61,1,FALSE)),IF($C195<>\"\",$C195,\"\"),\"\")","v":""},6,"Mestvaalt 12","","","","","","","","","","","","","","","","","","","",186,null,null,null,null,null,null,"/","","","","","","","","","","","","","","","","","","",""]
[13,null,null,null,null,null,null,null,null,null,null,null,null,null,null,null,null,null,null,null,14,"Mestvaalt 13",null,{"$f":"IFERROR(VLOOKUP($C196,Blad3!$F$31:$F$61,1,FALSE),IF($C196<>\"\",\"ANDERE\",\"\"))","v":""},{"$f":"IF(ISERROR(VLOOKUP($C196,Blad3!$F$31:$F$61,1,FALSE)),IF($C196<>\"\",$C196,\"\"),\"\")","v":""},6,"Mestvaalt 13","","","","","","","","","","","","","","","","","","","",187,null,null,null,null,null,null,"/","","","","","","","","","","","","","","","","","","",""]
[14,null,null,null,null,null,null,null,null,null,null,null,null,null,null,null,null,null,null,null,15,"Mestvaalt 14",null,{"$f":"IFERROR(VLOOKUP($C197,Blad3!$F$31:$F$61,1,FALSE),IF($C197<>\"\",\"ANDERE\",\"\"))","v":""},{"$f":"IF(ISERROR(VLOOKUP($C197,Blad3!$F$31:$F$61,1,FALSE)),IF($C197<>\"\",$C197,\"\"),\"\")","v":""},6,"Mestvaalt 14","","","","","","","","","","","","","","","","","","","",188,null,null,null,null,null,null,"/","","","","","","","","","","","","","","","","","","",""]
[15,null,null,null,null,null,null,null,null,null,null,null,null,null,null,null,null,null,null,null,16,"Mestvaalt 15",null,{"$f":"IFERROR(VLOOKUP($C198,Blad3!$F$31:$F$61,1,FALSE),IF($C198<>\"\",\"ANDERE\",\"\"))","v":""},{"$f":"IF(ISERROR(VLOOKUP($C198,Blad3!$F$31:$F$61,1,FALSE)),IF($C198<>\"\",$C198,\"\"),\"\")","v":""},6,"Mestvaalt 15","","","","","","","","","","","","","","","","","","","",189,null,null,null,null,null,null,"/","","","","","","","","","","","","","","","","","","",""]
[16,null,null,null,null,null,null,null,null,null,null,null,null,null,null,null,null,null,null,null,17,"Mestvaalt 16",null,{"$f":"IFERROR(VLOOKUP($C199,Blad3!$F$31:$F$61,1,FALSE),IF($C199<>\"\",\"ANDERE\",\"\"))","v":""},{"$f":"IF(ISERROR(VLOOKUP($C199,Blad3!$F$31:$F$61,1,FALSE)),IF($C199<>\"\",$C199,\"\"),\"\")","v":""},6,"Mestvaalt 16","","","","","","","","","","","","","","","","","","","",190,null,null,null,null,null,null,"/","","","","","","","","","","","","","","","","","","",""]
[17,null,null,null,null,null,null,null,null,null,null,null,null,null,null,null,null,null,null,null,18,"Mestvaalt 17",null,{"$f":"IFERROR(VLOOKUP($C200,Blad3!$F$31:$F$61,1,FALSE),IF($C200<>\"\",\"ANDERE\",\"\"))","v":""},{"$f":"IF(ISERROR(VLOOKUP($C200,Blad3!$F$31:$F$61,1,FALSE)),IF($C200<>\"\",$C200,\"\"),\"\")","v":""},6,"Mestvaalt 17","","","","","","","","","","","","","","","","","","","",191,null,null,null,null,null,null,"/","","","","","","","","","","","","","","","","","","",""]
[18,null,null,null,null,null,null,null,null,null,null,null,null,null,null,null,null,null,null,null,19,"Mestvaalt 18",null,{"$f":"IFERROR(VLOOKUP($C201,Blad3!$F$31:$F$61,1,FALSE),IF($C201<>\"\",\"ANDERE\",\"\"))","v":""},{"$f":"IF(ISERROR(VLOOKUP($C201,Blad3!$F$31:$F$61,1,FALSE)),IF($C201<>\"\",$C201,\"\"),\"\")","v":""},6,"Mestvaalt 18","","","","","","","","","","","","","","","","","","","",192,null,null,null,null,null,null,"/","","","","","","","","","","","","","","","","","","",""]
[19,null,null,null,null,null,null,null,null,null,null,null,null,null,null,null,null,null,null,null,20,"Mestvaalt 19",null,{"$f":"IFERROR(VLOOKUP($C202,Blad3!$F$31:$F$61,1,FALSE),IF($C202<>\"\",\"ANDERE\",\"\"))","v":""},{"$f":"IF(ISERROR(VLOOKUP($C202,Blad3!$F$31:$F$61,1,FALSE)),IF($C202<>\"\",$C202,\"\"),\"\")","v":""},6,"Mestvaalt 19","","","","","","","","","","","","","","","","","","","",193,null,null,null,null,null,null,"/","","","","","","","","","","","","","","","","","","",""]
[20,null,null,null,null,null,null,null,null,null,null,null,null,null,null,null,null,null,null,null,1,"Mestvaalt 20",null,{"$f":"IFERROR(VLOOKUP($C203,Blad3!$F$31:$F$61,1,FALSE),IF($C203<>\"\",\"ANDERE\",\"\"))","v":""},{"$f":"IF(ISERROR(VLOOKUP($C203,Blad3!$F$31:$F$61,1,FALSE)),IF($C203<>\"\",$C203,\"\"),\"\")","v":""},6,"Mestvaalt 20","","","","","","","","","","","","","","","","","","","",194,null,null,null,null,null,null,{"$f":"IFERROR(VLOOKUP($AU203,$Z$10:$AT$203,AA$9,FALSE),\"/\")","v":"/"},"","","","","","","","","","","","","","","","","","",""]
[null,null,null,null,null,null,null,null,null,null,null,null,null,null,null,null,{"$f":"SUM(Q104:Q203)","v":0},{"$f":"SUM(R104:R203)","v":0},{"$f":"SUM(S104:S203)","v":0},{"$f":"SUM(T104:T203)","v":0},null,null,null,null,null,null,null,null,null,null,null,null,null,null,null,null,null,null,null,null,null,null,null,null,null,null,null,null,null,null,null,null,null,null,null,null,null,null,null,null,null,null,null,null,null,null,null,null,null,{"$f":"SUM(BR29:BR203)","v":0},{"$f":"SUM(BS29:BS203)","v":0}]

{"sheet":"Afdrukversie","index":4,"n_rows":7,"n_cols":54,"rows_kept":7,"cut":false,"hidden":false,"merged":[[5,6,5,7],[5,8,5,9],[6,2,6,3],[6,4,6,5],[6,6,6,7],[6,8,6,9],[0,0,0,19],[2,0,3,1],[5,0,6,1],[2,2,2,3],[2,4,2,5],[2,6,2,7],[2,8,2,9],[3,2,3,3],[3,4,3,5],[3,6,3,7],[3,8,3,9],[5,2,5,3],[5,4,5,5]]}
["Samenvatting van alle opslagen op het bedrijf",null,null,null,null,null,null,null,null,null,null,null,null,null,null,null,null,null,null,null,null,null,null,null,null,null,null,null,null,null,null,null,null,null,null,null,null,null,null,null,null,null,null,null,null,null,null,null,null,null,null,null,null,1]
[]
["Totale opslag vloeibare mest",null,"Capaciteit",null,"Opgeslagen",null,"Inhoud N",null,"Inhoud P2O5"]
[null,null,{"$f":"'Samenvatting opslagen'!E4","v":0},null,{"$f":"'Samenvatting opslagen'!G4","v":0},null,{"$f":"'Samenvatting opslagen'!I4","v":0},null,{"$f":"'Samenvatting opslagen'!K4","v":0}]
[]
["Totale opslag vaste mest",null,"Capaciteit",null,"Opgeslagen",null,"Inhoud N",null,"Inhoud P2O5"]
[null,null,{"$f":"'Samenvatting opslagen'!E7","v":0},null,{"$f":"'Samenvatting opslagen'!G7","v":0},null,{"$f":"'Samenvatting opslagen'!I7","v":0},null,{"$f":"'Samenvatting opslagen'!K7","v":0}]

{"sheet":"versiebeheer","index":5,"n_rows":5,"n_cols":3,"rows_kept":5,"cut":false,"hidden":false,"merged":[[11,2,11,5],[12,2,12,5],[1,2,1,5],[2,2,2,5],[3,2,3,5],[4,2,4,5],[5,2,5,5],[6,2,6,5],[0,0,0,5],[7,2,7,5],[8,2,8,5],[9,2,9,5],[10,2,10,5],[13,2,13,5],[14,2,14,5],[16,2,16,5],[17,2,17,5],[15,2,15,5]]}
["Wijziging"]
["datum","Wat","Reden"]
[" 9/1/2019","Lagune vloeibare mest","* Verwijzing naar foutieve cel waardoor de opgeslagen inhoud niet correct werd berekend ==> werd hierdoor te hoog berekend.\n* Berekening op basis van het grondvlak."]
["2019-01-22","afdrukversie optimaliseren"]
["2019-02-27","vloeibare opslag V-put","bij niveauberekening is het tan i.p.v. cos"]