{"text_format":"1","workbook":"xlsx","n_sheets":8,"sheets":["In te vullen voorblad","facturen-kosten","loonberek invullen promotor","tijdsregist invullen promotor","waarden lonen","voorbeeld tijdsreg","Voorbeeld loonberek","."],"not_rendered":{"charts":0,"images":2,"macros":1,"external_links":3,"defined_names":33,"comments":4,"pivot_tables":0},"unopened":[],"bounds":{"document_bytes":16777216,"sheet_cells":100000,"rows_first":2000,"rows_last":500,"rows_between":2000,"halvings":0,"cell_chars":16384,"cell_head_chars":4096},"cells_cut":0,"cells_raw":0,"read":"whole","date_system":"1900"}

{"sheet":"In te vullen voorblad","index":0,"n_rows":41,"n_cols":3,"rows_kept":41,"cut":false,"hidden":false,"merged":[[25,2,26,3],[18,2,19,3]]}
[]
[]
[]
[]
[]
[]
["Opgelet","Gelieve dit voorblad in te vullen identiek zoals in het plattelandsloket"]
["Datum aanvraag:",{"$f":"TODAY()","v":"2022-07-07"}]
[]
["Gegevens project"]
[]
["Projectnaam:","……………………………………"]
["Projectcode:","OVL17/SW/01"]
["Budgetjaar: ","……………………………………"]
["Overhead% bij personeelskosten",10,"Opgelet: overheadpercentage moet exact gelijk zijn aan het goedgekeurde %"]
[]
["Gegevens projectpromotor"]
[]
["Naam:","XXXXX","Opgelet: de schrijfwijze van de naam van de promotor moet exact overeenkomen met de schrijfwijze in het e-loket"]
["Adres:","……………………………………"]
{"$rows_left_out":22}
{"sheet":"facturen-kosten","index":1,"n_rows":33,"n_cols":14,"rows_kept":33,"cut":false,"hidden":false,"merged":[[33,2,33,7],[0,3,0,5],[1,5,8,8]]}
[null,"Projectnaam",null,{"$f":" 'In te vullen voorblad'!B12","v":"……………………………………"},null,null,null,null,null,"Rubrieken","ingediende kost","Promotor/ copromotor",null,"ingediende kost"]
[null,"Projectpromotor",null,{"$f":"'In te vullen voorblad'!B19","v":"XXXXX"},null,"Toelichting bij het gebruik van de knop 'Facturen Json (bulk)': Door het klikken op deze knop worden de gegevens op dit blad gekopieerd (rij 13 tot einde van tabel). Deze gegevens kunnen met behulp van de toetsencombinatie CTRL+V geplakt worden in het pop-upvenster in het e-loket (bij gebruik van de knop 'Facturen Json (bulk)' in het loket). \nOpgelet: Hiermee worden geen andere tabbladen of gegevens van dit bestand gekopieerd naar het loket. Als de knop niet werkt staat er wellicht bovenaan een opmerking i.v.m. 'inhoud inschakelen' (deze moet eerst ingeschakeld worden) of werkt het niet in deze Excelversie (facturen kunnen dan individueel ingegeven worden in het loket).",null,null,null,{"$f":"'.'!C3","v":"Investeringskosten"},{"$f":"SUMIF(J:J,J2,I:I)","v":0},{"$f":"'In te vullen voorblad'!B19","v":"XXXXX"},null,{"$f":"SUMIF(K:K,L2,I:I)","v":0}]
[null,"Projectnummer",null,{"$f":"'In te vullen voorblad'!B13","v":"OVL17/SW/01"},null,null,null,null,null,{"$f":"'.'!C4","v":"Personeelskosten"},0,{"$f":"'In te vullen voorblad'!B28","v":"……………………………………"},null,0]
[null,"Budgetjaar",null,{"$f":" 'In te vullen voorblad'!B14","v":"……………………………………"},null,null,null,null,null,{"$f":"'.'!C5","v":"Werkingskosten"},0,{"$f":"'In te vullen voorblad'!B29","v":"……………………………………"},null,0]
[null,"Overhead%",null,{"$f":"'In te vullen voorblad'!B15","v":10},null,null,null,null,null,{"$f":"'.'!C6","v":"Externe prestaties"},0,{"$f":"'In te vullen voorblad'!B30","v":"……………………………………"},null,0]
[null,null,null,null,null,null,null,null,null,{"$f":"'.'!C7","v":"Bijdrage in natura"},0,{"$f":"'In te vullen voorblad'!B31","v":"……………………………………"},null,0]
[null,null,null,null,null,null,null,null,null,{"$f":"'.'!C8","v":"Inkomsten"},0,{"$f":"'In te vullen voorblad'!B32","v":"……………………………………"},null,0]
[]
[null,null,null,null,null,null,null,null,null,"Totaal",{"$f":"SUM(K2+K3+K4+K5+K6+K7)","v":0}]
[]
["Volgnr ","Boekhoud- kundig nummer van de factuur","Naam leverancier /                                                                       naam personeelslid","Onderwerp van de uitgave                                        ","FactuurDatum / Periode start","Periode einddatum","TotaalBedrag","Percentage dat het bedrag meetelt","Aangevraagd project-bedrag","rubriek ( in te vullen door een rubriek te selecteren , niet manueel intypen!!)","Aan wie is de factuur gericht promotor of copromotoren? (naam (co-)promotor selecteren of blanco indien promotor)","% Cofinanciering (max 65%)","totale cofinanc (totale overheidssteun)","Overhead Bedrag"]
["VolgNummer","BoekhoudkundigNummer","Leverancier","Onderwerp","FactuurPeriodeStartString","FactuurPeriodeEindString","TotaalBedrag","MeetelPercentage","AangevraagdProjectbedrag","KostenCategorie","Promotor","CofinancieringPercentage","TotaleCofinanciering","OverheadBedrag"]
[null,null,null,null,null,null,null,null,{"$f":"G13*H13","v":0},null,null,null,{"$f":"I13*L13","v":0},{"$f":"IF(J13=\"Personeelskosten\",M13*D$5%,0)","v":0}]
[null,null,null,null,null,null,null,null,0,null,null,null,{"$f":"I14*L14","v":0},{"$f":"IF(J14=\"Personeelskosten\",M14*D$5%,0)","v":0}]
[null,null,null,null,null,null,null,null,0,null,null,null,0,0]
[null,null,null,null,null,null,null,null,0,null,null,null,0,0]
[null,null,null,null,null,null,null,null,0,null,null,null,{"$f":"I17*L17","v":0},{"$f":"IF(J17=\"Personeelskosten\",M17*D$5%,0)","v":0}]
[null,null,null,null,null,null,null,null,0,null,null,null,0,0]
[null,null,null,null,null,null,null,null,0,null,null,null,{"$f":"I19*L19","v":0},{"$f":"IF(J19=\"Personeelskosten\",M19*D$5%,0)","v":0}]
[null,null,null,null,null,null,null,null,0,null,null,null,0,0]
{"$rows_left_out":14}
{"sheet":"loonberek invullen promotor","index":2,"n_rows":62,"n_cols":8,"rows_kept":62,"cut":false,"hidden":false,"merged":[[66,1,66,7],[61,1,61,7],[62,1,62,7],[63,1,63,7],[64,1,64,7],[65,1,65,7],[50,0,50,6],[58,0,58,6],[3,1,3,2],[4,1,4,7],[18,0,18,6],[26,0,26,6],[34,0,34,6],[42,0,42,6]]}
["Sjabloon loonberekening"]
[]
[]
["Projectcode",{"$f":" 'In te vullen voorblad'!B13","v":"OVL17/SW/01"}]
["Naam van het project",{"$f":" 'In te vullen voorblad'!B12","v":"……………………………………"}]
["Per persoon: de naam - brutoloon  - de periode (maand en jaartal)  en het aantal halve dagen in te vullen. "]
["De looncode wordt automatisch opgezocht en moet niet zelf ingevuld worden."]
["Enkel de groene vakken invullen!"]
["Het donkergroene vak overnemen in het tabblad facturen "]
["Naam personeelslid","Voltijds brutoloon (5/5)","De overeenkomstige dagkost","Looncode","Afwijkende looncode","maand + jaartal","aantal halve dagen in die maand gewerkt aan het project","In te brengen personeelskost"]
[]
[null,null,{"$f":"IF(E12=0,+IF(B12=\"\",\"\",+IF(B12<2152.45,190.86,IF(B12>=2152.45,VLOOKUP(B12,'waarden lonen'!C:K,9,TRUE)))),VLOOKUP(E12,'waarden lonen'!loonwijzer,11))","v":""},{"$f":"IF(E12=0,+IF(C12=\"\",\"\",VLOOKUP(C12,'waarden lonen'!K:L,2,FALSE)),\"\")","v":""},null,null,null,{"$f":"+IF(C12=\"\",\"\",(G12/2)*C12)","v":""}]
[null,null,{"$f":"IF(E13=0,+IF(B13=\"\",\"\",+IF(B13<2152.45,190.86,IF(B13>=2152.45,VLOOKUP(B13,'waarden lonen'!C:K,9,TRUE)))),VLOOKUP(E13,'waarden lonen'!loonwijzer,11))","v":""},{"$f":"IF(E13=0,+IF(C13=\"\",\"\",VLOOKUP(C13,'waarden lonen'!K:L,2,FALSE)),\"\")","v":""},null,null,null,{"$f":"+IF(C13=\"\",\"\",(G13/2)*C13)","v":""}]
[null,null,{"$f":"IF(E14=0,+IF(B14=\"\",\"\",+IF(B14<2152.45,190.86,IF(B14>=2152.45,VLOOKUP(B14,'waarden lonen'!C:K,9,TRUE)))),VLOOKUP(E14,'waarden lonen'!loonwijzer,11))","v":""},{"$f":"IF(E14=0,+IF(C14=\"\",\"\",VLOOKUP(C14,'waarden lonen'!K:L,2,FALSE)),\"\")","v":""},null,null,null,""]
[null,null,{"$f":"IF(E15=0,+IF(B15=\"\",\"\",+IF(B15<2152.45,190.86,IF(B15>=2152.45,VLOOKUP(B15,'waarden lonen'!C:K,9,TRUE)))),VLOOKUP(E15,'waarden lonen'!loonwijzer,11))","v":""},{"$f":"IF(E15=0,+IF(C15=\"\",\"\",VLOOKUP(C15,'waarden lonen'!K:L,2,FALSE)),\"\")","v":""},null,null,null,""]
[null,null,{"$f":"IF(E16=0,+IF(B16=\"\",\"\",+IF(B16<2152.45,190.86,IF(B16>=2152.45,VLOOKUP(B16,'waarden lonen'!C:K,9,TRUE)))),VLOOKUP(E16,'waarden lonen'!loonwijzer,11))","v":""},{"$f":"IF(E16=0,+IF(C16=\"\",\"\",VLOOKUP(C16,'waarden lonen'!K:L,2,FALSE)),\"\")","v":""},null,null,null,""]
[null,null,{"$f":"IF(E17=0,+IF(B17=\"\",\"\",+IF(B17<2152.45,190.86,IF(B17>=2152.45,VLOOKUP(B17,'waarden lonen'!C:K,9,TRUE)))),VLOOKUP(E17,'waarden lonen'!loonwijzer,11))","v":""},{"$f":"IF(E17=0,+IF(C17=\"\",\"\",VLOOKUP(C17,'waarden lonen'!K:L,2,FALSE)),\"\")","v":""},null,null,null,""]
[null,null,{"$f":"IF(E18=0,+IF(B18=\"\",\"\",+IF(B18<2152.45,190.86,IF(B18>=2152.45,VLOOKUP(B18,'waarden lonen'!C:K,9,TRUE)))),VLOOKUP(E18,'waarden lonen'!loonwijzer,11))","v":""},{"$f":"IF(E18=0,+IF(C18=\"\",\"\",VLOOKUP(C18,'waarden lonen'!K:L,2,FALSE)),\"\")","v":""},null,null,null,""]
["Totale loonkost - het totaal bedrag per persoon overnemen in de overzichtslijst met facturen / kosten",null,null,null,null,null,null,{"$f":"SUM(H12:H18)","v":0}]
[null,null,{"$f":"IF(E20=0,+IF(B20=\"\",\"\",+IF(B20<2152.45,190.86,IF(B20>=2152.45,VLOOKUP(B20,'waarden lonen'!C:K,9,TRUE)))),VLOOKUP(E20,'waarden lonen'!loonwijzer,11))","v":""},{"$f":"IF(E20=0,+IF(C20=\"\",\"\",VLOOKUP(C20,'waarden lonen'!K:L,2,FALSE)),\"\")","v":""},null,null,null,{"$f":"+IF(C20=\"\",\"\",(G20/2)*C20)","v":""}]
{"$rows_left_out":43}
{"sheet":"tijdsregist invullen promotor","index":3,"n_rows":53,"n_cols":5,"rows_kept":53,"cut":false,"hidden":false,"merged":[[2,1,2,2],[3,1,3,4],[8,1,8,4]]}
["Sjabloon tijdsregistratie"]
[]
["Projectcode",{"$f":"'In te vullen voorblad'!B13","v":"OVL17/SW/01"}]
["Naam van het project",{"$f":"'In te vullen voorblad'!B12","v":"……………………………………"}]
[]
["Per personeelslid een sjabloon invullen."]
[]
["Enkel de groene velden invullen"]
["Naam personeelslid"]
[]
["Korte omschrijving werkzaamheden per halve dag invullen","dag","maand","jaartal","1= halve dag PDPO  0=niet PDPO"]
[]
[]
[]
[]
[]
[]
[]
[]
[]
{"$rows_left_out":34}
{"sheet":"waarden lonen","index":4,"n_rows":30,"n_cols":12,"rows_kept":30,"cut":false,"hidden":false,"merged":[]}
["Standaard loontabel PDPO III te gebruiken vanaf 1 jan 2022"]
["Deze code gebruiken om in te vullen",null,"om te vergelijken met de loonfiche",null,null,null,null,null,null,null,"Kosten om te gebruiken bij declaratie (verlof, ziekte reeds verrekend in de dagkost)"]
["Loon-code","Wedde","Bruto maandloon","Vakantie-geld ","Eindejaars-premie","RSZ werkgever","Verzekering AO","Onkosten (weg - werk + thuiswerkvergoeding)","Maaltijd-cheques","Jaarkost","Dagkost","Loon-code"]
["A001",25829.45,{"$f":"B4/12","v":2152.4541666666669},1808.37,1736.6,8446.2377199999992,163.57145776999997,{"$f":"615.66+240","v":855.66},1241.1000000000001,{"$f":"SUM(B4,D4:I4)","v":40080.989177769996},190.86,"A001"]
["A002",28563.9,{"$f":"B5/12","v":2380.3250000000003},1992.7,1913.61,9338.3090640000009,180.81036438500001,{"$f":"615.66+240","v":855.66},1241.1000000000001,44086.089428385007,209.93,"A002"]
["A003",30060.45,2505.0374999999999,2093.58,2010.49,9826.536016,190.24512961999997,{"$f":"615.66+240","v":855.66},1241.1000000000001,46278.061145619999,220.37,"A003"]
["A004",30817.97,2568.1641666666669,2111.02,2027.24,10063.772343999999,194.65376675499996,855.66,1241.1000000000001,47311.416110754995,225.29,"A004"]
["A005",31760.240000000002,2646.686666666667,2174.54,2088.23,10371.171208,200.59413118500001,855.66,1241.1000000000001,48691.535339185,231.86,"A005"]
["A006",33644.800000000003,2803.7333333333336,2301.58,2210.23,10985.981192000003,212.47508278500004,855.66,1241.1000000000001,51451.826274785009,245.01,"A006"]
["A007",34975.07,2914.5891666666666,2357.63,2264.0500000000002,11410.066368000002,220.494502375,855.66,1241.1000000000001,53324.070870374999,253.92,"A007"]
["A008",36379.24,3031.603333333333,2452.2800000000002,2354.9499999999998,11868.155815999999,229.34685819499995,855.66,1241.1000000000001,55380.732674194995,263.72000000000003,"A008"]
["A009",39298.449999999997,3274.8708333333329,2649.06,2543.92,12820.502167999999,247.75052795499994,855.66,1241.1000000000001,59656.442695954996,284.08,"A009"]
["A010",40702.629999999997,3391.8858333333333,2743.71,2634.82,13278.59468,256.60293945999996,855.66,1241.1000000000001,61713.117619459998,293.87,"A010"]
["A011",41626.43,3468.8691666666668,2805.99,2479.1999999999998,13513.965032,261.22735596999996,855.66,1241.1000000000001,62783.572387969994,298.97000000000003,"A011"]
["A012",43012.13,3584.3441666666663,2899.39,2561.73,13963.830704,269.92329262499999,855.66,1241.1000000000001,64803.763996624999,308.58999999999997,"A012"]
["A013",44397.83,3699.8191666666667,2992.8,2644.26,14413.696376000002,278.61928496500002,855.66,1241.1000000000001,66823.965660965012,318.20999999999998,"A013"]
["A014",45691.15,3807.5958333333333,3079.98,2721.29,14833.571616000001,286.73554077,855.66,1241.1000000000001,68709.487156770017,327.19,"A014"]
["A015",48554.93,4046.2441666666668,3273.03,2891.85,15763.293392,304.70726198499995,855.66,1241.1000000000001,72884.570653984993,347.07,"A015"]
["A016",51326.33,4277.1941666666671,3459.84,3056.91,16663.024736000003,322.09919098,855.66,1241.1000000000001,76924.963926980025,366.31,"A016"]
["A017",54097.73,4508.1441666666669,3646.66,3221.97,17562.756080000003,339.49117566000001,855.66,1241.1000000000001,80965.367255660021,385.55,"A017"]
{"$rows_left_out":11}
{"sheet":"voorbeeld tijdsreg","index":5,"n_rows":53,"n_cols":5,"rows_kept":53,"cut":false,"hidden":false,"merged":[[2,1,2,2],[3,1,3,4],[8,1,8,4]]}
["Sjabloon tijdsregistratie"]
[]
["Projectcode",{"$f":" 'In te vullen voorblad'!B13","v":"OVL17/SW/01"}]
["Naam van het project",{"$f":" 'In te vullen voorblad'!B12","v":"……………………………………"}]
[]
["Per personeelslid een sjabloon invullen."]
[]
["Enkel de groene velden invullen"]
["Naam personeelslid","Mevr. Christine Janssens"]
[]
["Korte omschrijving werkzaamheden per halve dag invullen","dag","maand","jaartal","1= halve dag PDPO  0=niet PDPO"]
[]
["leveranciers zoeken voor de restauratie",2,"februari",2020,1]
["bezoek aan de te restaureren bakoven",2,"februari",2020,1]
["verlof",3,"februari",2020,0]
["verlof",3,"februari",2020,0]
["niet PDPO ",4,"februari",2020,0]
["niet PDPO ",4,"februari",2020,0]
["verminderde prestaties",5,"februari",2020,0]
["verminderde prestaties",5,"februari",2020,0]
{"$rows_left_out":34}
{"sheet":"Voorbeeld loonberek","index":6,"n_rows":65,"n_cols":8,"rows_kept":65,"cut":false,"hidden":false,"merged":[[43,0,43,6],[3,1,3,2],[4,1,4,7],[18,0,18,6],[26,0,26,6],[35,0,35,6],[67,1,67,7],[68,1,68,7],[51,0,51,6],[60,0,60,6],[63,1,63,7],[64,1,64,7],[65,1,65,7],[66,1,66,7]]}
["Sjabloon loonberekening"]
[]
[]
["Projectcode",{"$f":" 'In te vullen voorblad'!B13","v":"OVL17/SW/01"}]
["Naam van het project",{"$f":" 'In te vullen voorblad'!B12","v":"……………………………………"}]
["Per persoon: de naam - brutoloon  - de periode (maand en jaartal)  en het aantal halve dagen in te vullen. "]
["De looncode wordt automatisch opgezocht en moet niet zelf ingevuld worden."]
["Enkel de groene vakken invullen!"]
["Het donkergroene vak overnemen in het tabblad facturen "]
["Naam personeelslid","Voltijds brutoloon (5/5)","De overeenkomstige dagkost","Looncode","Afwijkende looncode","maand + jaartal","aantal halve dagen in die maand gewerkt aan het project","In te brengen personeelskost"]
[]
["Christine Janssens",2500,{"$f":"IF(E12=0,+IF(B12=\"\",\"\",+IF(B12<2028.27,179.06,IF(B12>=2028.27,VLOOKUP(B12,'waarden lonen'!C:K,9,TRUE)))),VLOOKUP(E12,'waarden lonen'!loonwijzer,11))","v":209.93},{"$f":"IF(E12=0,+IF(C12=\"\",\"\",VLOOKUP(C12,'waarden lonen'!K:L,2,FALSE)),\"\")","v":"A002"},null,"2020-07-01",13,{"$f":"+IF(C12=\"\",\"\",(G12/2)*C12)","v":1364.5450000000001}]
["Christine Janssens",2500,{"$f":"IF(E13=0,+IF(B13=\"\",\"\",+IF(B13<2028.27,179.06,IF(B13>=2028.27,VLOOKUP(B13,'waarden lonen'!C:K,9,TRUE)))),VLOOKUP(E13,'waarden lonen'!loonwijzer,11))","v":209.93},{"$f":"IF(E13=0,+IF(C13=\"\",\"\",VLOOKUP(C13,'waarden lonen'!K:L,2,FALSE)),\"\")","v":"A002"},null,"2020-08-01",10,1049.6500000000001]
[null,null,{"$f":"IF(E14=0,+IF(B14=\"\",\"\",+IF(B14<2028.27,179.06,IF(B14>=2028.27,VLOOKUP(B14,'waarden lonen'!C:K,9,TRUE)))),VLOOKUP(E14,'waarden lonen'!loonwijzer,11))","v":""},{"$f":"IF(E14=0,+IF(C14=\"\",\"\",VLOOKUP(C14,'waarden lonen'!K:L,2,FALSE)),\"\")","v":""},null,null,null,""]
[null,null,{"$f":"IF(E15=0,+IF(B15=\"\",\"\",+IF(B15<2028.27,179.06,IF(B15>=2028.27,VLOOKUP(B15,'waarden lonen'!C:K,9,TRUE)))),VLOOKUP(E15,'waarden lonen'!loonwijzer,11))","v":""},{"$f":"IF(E15=0,+IF(C15=\"\",\"\",VLOOKUP(C15,'waarden lonen'!K:L,2,FALSE)),\"\")","v":""},null,null,null,""]
[null,null,{"$f":"IF(E16=0,+IF(B16=\"\",\"\",+IF(B16<2028.27,179.06,IF(B16>=2028.27,VLOOKUP(B16,'waarden lonen'!C:K,9,TRUE)))),VLOOKUP(E16,'waarden lonen'!loonwijzer,11))","v":""},{"$f":"IF(E16=0,+IF(C16=\"\",\"\",VLOOKUP(C16,'waarden lonen'!K:L,2,FALSE)),\"\")","v":""},null,null,null,""]
[null,null,{"$f":"IF(E17=0,+IF(B17=\"\",\"\",+IF(B17<2028.27,179.06,IF(B17>=2028.27,VLOOKUP(B17,'waarden lonen'!C:K,9,TRUE)))),VLOOKUP(E17,'waarden lonen'!loonwijzer,11))","v":""},{"$f":"IF(E17=0,+IF(C17=\"\",\"\",VLOOKUP(C17,'waarden lonen'!K:L,2,FALSE)),\"\")","v":""},null,null,null,""]
[null,null,{"$f":"IF(E18=0,+IF(B18=\"\",\"\",+IF(B18<2028.27,179.06,IF(B18>=2028.27,VLOOKUP(B18,'waarden lonen'!C:K,9,TRUE)))),VLOOKUP(E18,'waarden lonen'!loonwijzer,11))","v":""},{"$f":"IF(E18=0,+IF(C18=\"\",\"\",VLOOKUP(C18,'waarden lonen'!K:L,2,FALSE)),\"\")","v":""},null,null,null,""]
["Totale loonkost - het totaal bedrag per persoon overnemen in de overzichtslijst met facturen / kosten",null,null,null,null,null,null,{"$f":"SUM(H12:H18)","v":2414.1950000000002}]
["Jan Janssens",2242.9899999999998,{"$f":"IF(E20=0,+IF(B20=\"\",\"\",+IF(B20<2028.27,179.06,IF(B20>=2028.27,VLOOKUP(B20,'waarden lonen'!C:K,9,TRUE)))),VLOOKUP(E20,'waarden lonen'!loonwijzer,11))","v":220.37},{"$f":"IF(E20=0,+IF(C20=\"\",\"\",VLOOKUP(C20,'waarden lonen'!K:L,2,FALSE)),\"\")","v":""},"A003","2020-07-01",8,{"$f":"+IF(C20=\"\",\"\",(G20/2)*C20)","v":881.48}]
{"$rows_left_out":46}
{"sheet":".","index":7,"n_rows":26,"n_cols":5,"rows_kept":26,"cut":false,"hidden":false,"merged":[]}
[]
[null,null,null,null,"json"]
[null,null,"Investeringskosten",null,"{"]
[null,null,"Personeelskosten",null,"\""]
[null,null,"Werkingskosten",null,":"]
[null,null,"Externe prestaties",null,"}"]
[null,null,"Bijdrage in natura",null,","]
[null,null,"Inkomsten",null,"["]
[null,null,null,null,"]"]
[]
[]
[]
[]
[]
[null,null,{"$f":"'In te vullen voorblad'!B19","v":"XXXXX"}]
[null,null,{"$f":"'In te vullen voorblad'!B28","v":"……………………………………"}]
[null,null,{"$f":"'In te vullen voorblad'!B29","v":"……………………………………"}]
[null,null,{"$f":"'In te vullen voorblad'!B30","v":"……………………………………"}]
[null,null,{"$f":"'In te vullen voorblad'!B31","v":"……………………………………"}]
[null,null,{"$f":"'In te vullen voorblad'!B32","v":"……………………………………"}]
{"$rows_left_out":6}